* [gentoo-user] Fwd: gnome-applets-python 装不上 [not found] <CAChzKCq_7xGWz_Pq5cOTGVzquHY0rw5-9tpWDchOjtxRVXLwUQ@mail.gmail.com> @ 2011-10-21 6:57 ` co 2011-10-21 7:40 ` Dale 0 siblings, 1 reply; 9+ messages in thread From: co @ 2011-10-21 6:57 UTC (permalink / raw To: gentoo-user [-- Attachment #1: Type: text/plain, Size: 6863 bytes --] can't emerge gnome-applets-python what's the problem? * ERROR: dev-python/gnome-applets-python-2.32.0 failed (compile phase): * Building failed with CPython 2.7 in python_default_function() function * * Call stack: * ebuild.sh, line 56: Called src_compile * environment, line 6045: Called gnome-python-common_src_compile * environment, line 3099: Called python_src_compile * environment, line 5899: Called python_execute_function '-d' '-s' '--' * environment, line 4352: Called die * The specific snippet of code: * die "${failure_message}"; * * If you need support, post the output of 'emerge --info =dev-python/gnome-applets-python-2.32.0', * the complete build log and the output of 'emerge -pqv =dev-python/gnome-applets-python-2.32.0'. * The complete build log is located at '/var/tmp/portage/dev-python/gnome-applets-python-2.32.0/temp/build.log'. * The ebuild environment file is located at '/var/tmp/portage/dev-python/gnome-applets-python-2.32.0/temp/environment'. * S: '/var/tmp/portage/dev-python/gnome-applets-python-2.32.0/work/gnome-python-desktop-2.32.0' >>> Failed to emerge dev-python/gnome-applets-python-2.32.0, Log file: >>> '/var/tmp/portage/dev-python/gnome-applets-python-2.32.0/temp/build.log' * Messages for package dev-python/gnome-applets-python-2.32.0: * ERROR: dev-python/gnome-applets-python-2.32.0 failed (compile phase): * Building failed with CPython 2.7 in python_default_function() function * * Call stack: * ebuild.sh, line 56: Called src_compile * environment, line 6045: Called gnome-python-common_src_compile * environment, line 3099: Called python_src_compile * environment, line 5899: Called python_execute_function '-d' '-s' '--' * environment, line 4352: Called die * The specific snippet of code: * die "${failure_message}"; * * If you need support, post the output of 'emerge --info =dev-python/gnome-applets-python-2.32.0', * the complete build log and the output of 'emerge -pqv =dev-python/gnome-applets-python-2.32.0'. * The complete build log is located at '/var/tmp/portage/dev-python/gnome-applets-python-2.32.0/temp/build.log'. * The ebuild environment file is located at '/var/tmp/portage/dev-python/gnome-applets-python-2.32.0/temp/environment'. * S: '/var/tmp/portage/dev-python/gnome-applets-python-2.32.0/work/gnome-python-desktop-2.32.0' #emerge --info =dev-python/gnome-applets-python-2.32.0 Portage 2.1.10.11 (default/linux/amd64/10.0, gcc-4.4.5, glibc-2.12.2-r0, 2.6.39-gentoo-r3 x86_64) ================================================================= System Settings ================================================================= System uname: Linux-2.6.39-gentoo-r3-x86_64-Intel-R-_Core-TM-_i5_CPU_M_430_@ _2.27GHz-with-gentoo-2.0.3 Timestamp of tree: Fri, 21 Oct 2011 03:30:01 +0000 ccache version 2.4 [enabled] app-shells/bash: 4.1_p9 dev-lang/python: 2.6.6-r2, 2.7.1-r1, 3.1.3-r1 dev-util/ccache: 2.4-r9 dev-util/cmake: 2.8.4-r1 dev-util/pkgconfig: 0.26 sys-apps/baselayout: 2.0.3 sys-apps/openrc: 0.8.3-r1 sys-apps/sandbox: 2.4 sys-devel/autoconf: 2.13, 2.68 sys-devel/automake: 1.11.1 sys-devel/binutils: 2.21.1-r1 sys-devel/gcc: 4.4.5, 4.5.3-r1 sys-devel/gcc-config: 1.4.1-r1 sys-devel/libtool: 2.4-r1 sys-devel/make: 3.82-r1 sys-kernel/linux-headers: 2.6.36.1 (virtual/os-headers) sys-libs/glibc: 2.12.2 Repositories: gentoo ACCEPT_KEYWORDS="amd64" ACCEPT_LICENSE="* -@EULA" CBUILD="x86_64-pc-linux-gnu" CFLAGS="-march=core2 -O2 -pipe" CHOST="x86_64-pc-linux-gnu" CONFIG_PROTECT="/etc" CONFIG_PROTECT_MASK="/etc/ca-certificates.conf /etc/dconf /etc/env.d /etc/fonts/fonts.conf /etc/gconf /etc/gentoo-release /etc/revdep-rebuild /etc/sandbox.d /etc/terminfo" CXXFLAGS="-march=core2 -O2 -pipe" DISTDIR="/usr/portage/distfiles" EMERGE_DEFAULT_OPTS="--autounmask=n" FEATURES="assume-digests binpkg-logs ccache distlocks ebuild-locks fixlafiles fixpackages news parallel-fetch protect-owned sandbox sfperms strict unknown-features-warn unmerge-logs unmerge-orphans userfetch" FFLAGS="" GENTOO_MIRRORS="http://mirror.the-best-hosting.net/" LANG="en_US.utf8" LDFLAGS="-Wl,-O1 -Wl,--as-needed" PKGDIR="/usr/portage/packages" PORTAGE_CONFIGROOT="/" PORTAGE_RSYNC_OPTS="--recursive --links --safe-links --perms --times --compress --force --whole-file --delete --stats --timeout=180 --exclude=/distfiles --exclude=/local --exclude=/packages" PORTAGE_TMPDIR="/var/tmp" PORTDIR="/usr/portage" PORTDIR_OVERLAY="" SYNC="rsync://rsync.gentoo.org/gentoo-portage" USE="(mutilib) 64bit X acl amd64 berkdb bzip2 cairo cdda cli community consolekit cracklib crypt cups cxx dbus device-mapper dri extras fontconfig fortran gdbm gdu gnome gpm gtk hal iconv icu ipv6 jpeg mmx modules mudflap multilib ncurses nls nptl nptlonly openmp pam pcre png policykit pppd python qt readline session sqlite sqlite:3 sse sse2 ssl sysfs tcpd tk truetype unicode vdpau vim vim-syntax xorg zlib" ALSA_CARDS="ali5451 als4000 atiixp atiixp-modem bt87x ca0106 cmipci emu10k1x ens1370 ens1371 es1938 es1968 fm801 hda-intel intel8x0 intel8x0m maestro3 trident usb-audio via82xx via82xx-modem ymfpci" ALSA_PCM_PLUGINS="adpcm alaw asym copy dmix dshare dsnoop empty extplug file hooks iec958 ioplug ladspa lfloat linear meter mmap_emul mulaw multi null plug rate route share shm softvol" APACHE2_MODULES="actions alias auth_basic authn_alias authn_anon authn_dbm authn_default authn_file authz_dbm authz_default authz_groupfile authz_host authz_owner authz_user autoindex cache cgi cgid dav dav_fs dav_lock deflate dir disk_cache env expires ext_filter file_cache filter headers include info log_config logio mem_cache mime mime_magic negotiation rewrite setenvif speling status unique_id userdir usertrack vhost_alias" CALLIGRA_FEATURES="kexi words flow plan stage tables krita karbon braindump" CAMERAS="ptp2" COLLECTD_PLUGINS="df interface irq load memory rrdtool swap syslog" ELIBC="glibc" GPSD_PROTOCOLS="ashtech aivdm earthmate evermore fv18 garmin garmintxt gpsclock itrax mtk3301 nmea ntrip navcom oceanserver oldstyle oncore rtcm104v2 rtcm104v3 sirf superstar2 timing tsip tripmate tnt ubx" INPUT_DEVICES="keyboard mouse synaptics" KERNEL="linux" LCD_DEVICES="bayrad cfontz cfontz633 glk hd44780 lb216 lcdm001 mtxorb ncurses text" PHP_TARGETS="php5-3" RUBY_TARGETS="ruby18" USERLAND="GNU" VIDEO_CARDS="nvidia" XTABLES_ADDONS="quota2 psd pknock lscan length2 ipv4options ipset ipp2p iface geoip fuzzy condition tee tarpit sysrq steal rawnat logmark ipmark dhcpmac delude chaos account" Unset: CPPFLAGS, CTARGET, INSTALL_MASK, LC_ALL, LINGUAS, MAKEOPTS, PORTAGE_BUNZIP2_COMMAND, PORTAGE_COMPRESS, PORTAGE_COMPRESS_FLAGS, PORTAGE_RSYNC_EXTRA_OPTS [-- Attachment #2: Type: text/html, Size: 8811 bytes --] ^ permalink raw reply [flat|nested] 9+ messages in thread
* Re: [gentoo-user] Fwd: gnome-applets-python 装不上 2011-10-21 6:57 ` [gentoo-user] Fwd: gnome-applets-python 装不上 co @ 2011-10-21 7:40 ` Dale 2011-10-21 8:03 ` [gentoo-user] " co 0 siblings, 1 reply; 9+ messages in thread From: Dale @ 2011-10-21 7:40 UTC (permalink / raw To: gentoo-user co wrote: > > can't emerge gnome-applets-python > what's the problem? > > * ERROR: dev-python/gnome-applets-python-2.32.0 failed (compile phase): > * Building failed with CPython 2.7 in python_default_function() > function > * > * Call stack: > * ebuild.sh, line 56: Called src_compile > * environment, line 6045: Called gnome-python-common_src_compile > * environment, line 3099: Called python_src_compile > * environment, line 5899: Called python_execute_function '-d' '-s' > '--' > * environment, line 4352: Called die > * The specific snippet of code: > * die "${failure_message}"; > * > * If you need support, post the output of 'emerge --info > =dev-python/gnome-applets-python-2.32.0', > * the complete build log and the output of 'emerge -pqv > =dev-python/gnome-applets-python-2.32.0'. > * The complete build log is located at > '/var/tmp/portage/dev-python/gnome-applets-python-2.32.0/temp/build.log'. > * The ebuild environment file is located at > '/var/tmp/portage/dev-python/gnome-applets-python-2.32.0/temp/environment'. > * S: > '/var/tmp/portage/dev-python/gnome-applets-python-2.32.0/work/gnome-python-desktop-2.32.0' > > >>> Failed to emerge dev-python/gnome-applets-python-2.32.0, Log file: > > >>> > '/var/tmp/portage/dev-python/gnome-applets-python-2.32.0/temp/build.log' > > * Messages for package dev-python/gnome-applets-python-2.32.0: > > * ERROR: dev-python/gnome-applets-python-2.32.0 failed (compile phase): > * Building failed with CPython 2.7 in python_default_function() > function > * > * Call stack: > * ebuild.sh, line 56: Called src_compile > * environment, line 6045: Called gnome-python-common_src_compile > * environment, line 3099: Called python_src_compile > * environment, line 5899: Called python_execute_function '-d' '-s' > '--' > * environment, line 4352: Called die > * The specific snippet of code: > * die "${failure_message}"; > * > * If you need support, post the output of 'emerge --info > =dev-python/gnome-applets-python-2.32.0', > * the complete build log and the output of 'emerge -pqv > =dev-python/gnome-applets-python-2.32.0'. > * The complete build log is located at > '/var/tmp/portage/dev-python/gnome-applets-python-2.32.0/temp/build.log'. > * The ebuild environment file is located at > '/var/tmp/portage/dev-python/gnome-applets-python-2.32.0/temp/environment'. > * S: > '/var/tmp/portage/dev-python/gnome-applets-python-2.32.0/work/gnome-python-desktop-2.32.0' > You need to post farther back than this. Sometimes it fails farther back than expected. See if you can find "Error 1" and then go back at least a couple dozen lines. That *usually* is far enough. Dale :-) :-) ^ permalink raw reply [flat|nested] 9+ messages in thread
* [gentoo-user] Re: [gentoo-user] Fwd: gnome-applets-python 装不上 2011-10-21 7:40 ` Dale @ 2011-10-21 8:03 ` co 2011-10-21 9:07 ` [gentoo-user] " Jonas de Buhr 0 siblings, 1 reply; 9+ messages in thread From: co @ 2011-10-21 8:03 UTC (permalink / raw To: gentoo-user [-- Attachment #1: Type: text/plain, Size: 3838 bytes --] Thankyou, I found this note: pygtk-codegen-2.0 is deprecated, use pygobject-codegen-2.0 instead note: I will now try to invoke pygobject-codegen-2.0 in the same directory Could not write function factory_main: No ArgType for PanelAppletFactoryCallback Could not write function panel_applet_shlib_factory: No ArgType for gpointer Could not write function panel_applet_shlib_factory_closure: No ArgType for gpointer Could not write function main: No ArgType for char*-argv Warning: Constructor for PanelApplet needs to be updated to new API See http://live.gnome.org/PyGTK_2fWhatsNew28#update-constructors ***INFO*** The coverage of global functions is 33.33% (2/6) ***INFO*** The coverage of methods is 100.00% (13/13) ***INFO*** There are no declared virtual proxies. ***INFO*** There are no declared virtual accessors. ***INFO*** There are no declared interface proxies. 2011/10/21 Dale <rdalek1967@gmail.com> > co wrote: > >> >> can't emerge gnome-applets-python >> what's the problem? >> >> * ERROR: dev-python/gnome-applets-**python-2.32.0 failed (compile >> phase): >> * Building failed with CPython 2.7 in python_default_function() >> function >> * >> * Call stack: >> * ebuild.sh, line 56: Called src_compile >> * environment, line 6045: Called gnome-python-common_src_**compile >> * environment, line 3099: Called python_src_compile >> * environment, line 5899: Called python_execute_function '-d' '-s' >> '--' >> * environment, line 4352: Called die >> * The specific snippet of code: >> * die "${failure_message}"; >> * >> * If you need support, post the output of 'emerge --info >> =dev-python/gnome-applets-**python-2.32.0', >> * the complete build log and the output of 'emerge -pqv >> =dev-python/gnome-applets-**python-2.32.0'. >> * The complete build log is located at '/var/tmp/portage/dev-python/** >> gnome-applets-python-2.32.0/**temp/build.log'. >> * The ebuild environment file is located at '/var/tmp/portage/dev-python/ >> **gnome-applets-python-2.32.0/**temp/environment'. >> * S: '/var/tmp/portage/dev-python/**gnome-applets-python-2.32.0/** >> work/gnome-python-desktop-2.**32.0' >> >> >>> Failed to emerge dev-python/gnome-applets-**python-2.32.0, Log file: >> >> >>> '/var/tmp/portage/dev-python/**gnome-applets-python-2.32.0/** >> temp/build.log' >> >> * Messages for package dev-python/gnome-applets-**python-2.32.0: >> >> * ERROR: dev-python/gnome-applets-**python-2.32.0 failed (compile >> phase): >> * Building failed with CPython 2.7 in python_default_function() >> function >> * >> * Call stack: >> * ebuild.sh, line 56: Called src_compile >> * environment, line 6045: Called gnome-python-common_src_**compile >> * environment, line 3099: Called python_src_compile >> * environment, line 5899: Called python_execute_function '-d' '-s' >> '--' >> * environment, line 4352: Called die >> * The specific snippet of code: >> * die "${failure_message}"; >> * >> * If you need support, post the output of 'emerge --info >> =dev-python/gnome-applets-**python-2.32.0', >> * the complete build log and the output of 'emerge -pqv >> =dev-python/gnome-applets-**python-2.32.0'. >> * The complete build log is located at '/var/tmp/portage/dev-python/** >> gnome-applets-python-2.32.0/**temp/build.log'. >> * The ebuild environment file is located at '/var/tmp/portage/dev-python/ >> **gnome-applets-python-2.32.0/**temp/environment'. >> * S: '/var/tmp/portage/dev-python/**gnome-applets-python-2.32.0/** >> work/gnome-python-desktop-2.**32.0' >> >> > You need to post farther back than this. Sometimes it fails farther back > than expected. See if you can find "Error 1" and then go back at least a > couple dozen lines. That *usually* is far enough. > > Dale > > :-) :-) > > [-- Attachment #2: Type: text/html, Size: 4876 bytes --] ^ permalink raw reply [flat|nested] 9+ messages in thread
* [gentoo-user] Re: [gentoo-user] Re: [gentoo-user] Fwd: gnome-applets-python 装不上 2011-10-21 8:03 ` [gentoo-user] " co @ 2011-10-21 9:07 ` Jonas de Buhr 2011-10-21 9:15 ` [gentoo-user] " co 0 siblings, 1 reply; 9+ messages in thread From: Jonas de Buhr @ 2011-10-21 9:07 UTC (permalink / raw To: gentoo-user just give the *full* output of the emerge command you ran. Am 21.10.2011 10:03, schrieb co: > Thankyou, I found this > [SNIP] > ^ permalink raw reply [flat|nested] 9+ messages in thread
* [gentoo-user] Re: [gentoo-user] Re: [gentoo-user] Re: [gentoo-user] Fwd: gnome-applets-python 装不上 2011-10-21 9:07 ` [gentoo-user] " Jonas de Buhr @ 2011-10-21 9:15 ` co 2011-10-21 9:38 ` [gentoo-user] " Jonas de Buhr 2011-10-21 9:40 ` Dale 0 siblings, 2 replies; 9+ messages in thread From: co @ 2011-10-21 9:15 UTC (permalink / raw To: gentoo-user [-- Attachment #1: Type: text/plain, Size: 22229 bytes --] build.log [32;01m * [39;49;00mPackage: dev-python/gnome-applets-python-2.32.0 [32;01m * [39;49;00mRepository: gentoo [32;01m * [39;49;00mMaintainer: gnome@gentoo.org [32;01m * [39;49;00mUSE: amd64 elibc_glibc kernel_linux multilib userland_GNU [32;01m * [39;49;00mFEATURES: ccache sandbox >>> Unpacking source... >>> Unpacking gnome-python-desktop-2.32.0.tar.bz2 to /var/tmp/portage/dev-python/gnome-applets-python-2.32.0/work >>> Source unpacked in /var/tmp/portage/dev-python/gnome-applets-python-2.32.0/work >>> Preparing source in /var/tmp/portage/dev-python/gnome-applets-python-2.32.0/work/gnome-python-desktop-2.32.0 ... [32;01m* [0m Fixing OMF Makefiles ... [A [72C [34;01m[ [32;01mok [34;01m ] [0m [32;01m* [0m Running elibtoolize in: gnome-python-desktop-2.32.0/ [32;01m* [0m Applying portage/2.2 patch ... [32;01m* [0m Applying sed/1.5.6 patch ... [32;01m* [0m Applying as-needed/2.2.6 patch ... >>> Source prepared. >>> Configuring source in /var/tmp/portage/dev-python/gnome-applets-python-2.32.0/work/gnome-python-desktop-2.32.0 ... * Configuration of dev-python/gnome-applets-python-2.32.0 with CPython 2.7... * econf: updating gnome-python-desktop-2.32.0/config.guess with /usr/share/gnuconfig/config.guess * econf: updating gnome-python-desktop-2.32.0/config.sub with /usr/share/gnuconfig/config.sub * econf: updating gnome-python-desktop-2.32.0-2.7/config.guess with /usr/share/gnuconfig/config.guess * econf: updating gnome-python-desktop-2.32.0-2.7/config.sub with /usr/share/gnuconfig/config.sub ./configure --prefix=/usr --build=x86_64-pc-linux-gnu --host=x86_64-pc-linux-gnu --mandir=/usr/share/man --infodir=/usr/share/info --datadir=/usr/share --sysconfdir=/etc --localstatedir=/var/lib --libdir=/usr/lib64 --disable-allbindings --enable-applet checking for a BSD-compatible install... /usr/bin/install -c checking whether build environment is sane... yes checking for a thread-safe mkdir -p... /bin/mkdir -p checking for gawk... gawk checking whether make sets $(MAKE)... yes checking build system type... x86_64-pc-linux-gnu checking host system type... x86_64-pc-linux-gnu checking for style of include used by make... GNU checking for x86_64-pc-linux-gnu-gcc... x86_64-pc-linux-gnu-gcc checking whether the C compiler works... yes checking for C compiler default output file name... a.out checking for suffix of executables... checking whether we are cross compiling... no checking for suffix of object files... o checking whether we are using the GNU C compiler... yes checking whether x86_64-pc-linux-gnu-gcc accepts -g... yes checking for x86_64-pc-linux-gnu-gcc option to accept ISO C89... none needed checking dependency style of x86_64-pc-linux-gnu-gcc... gcc3 checking for a sed that does not truncate output... /bin/sed checking for grep that handles long lines and -e... /bin/grep checking for egrep... /bin/grep -E checking for fgrep... /bin/grep -F checking for ld used by x86_64-pc-linux-gnu-gcc... /usr/x86_64-pc-linux-gnu/bin/ld checking if the linker (/usr/x86_64-pc-linux-gnu/bin/ld) is GNU ld... yes checking for BSD- or MS-compatible name lister (nm)... /usr/bin/nm -B checking the name lister (/usr/bin/nm -B) interface... BSD nm checking whether ln -s works... yes checking the maximum length of command line arguments... 1572864 checking whether the shell understands some XSI constructs... yes checking whether the shell understands "+="... yes checking for /usr/x86_64-pc-linux-gnu/bin/ld option to reload object files... -r checking for x86_64-pc-linux-gnu-objdump... x86_64-pc-linux-gnu-objdump checking how to recognize dependent libraries... pass_all checking for x86_64-pc-linux-gnu-ar... x86_64-pc-linux-gnu-ar checking for x86_64-pc-linux-gnu-strip... x86_64-pc-linux-gnu-strip checking for x86_64-pc-linux-gnu-ranlib... x86_64-pc-linux-gnu-ranlib checking command to parse /usr/bin/nm -B output from x86_64-pc-linux-gnu-gcc object... ok checking how to run the C preprocessor... x86_64-pc-linux-gnu-gcc -E checking for ANSI C header files... yes checking for sys/types.h... yes checking for sys/stat.h... yes checking for stdlib.h... yes checking for string.h... yes checking for memory.h... yes checking for strings.h... yes checking for inttypes.h... yes checking for stdint.h... yes checking for unistd.h... yes checking for dlfcn.h... yes checking for objdir... .libs checking if x86_64-pc-linux-gnu-gcc supports -fno-rtti -fno-exceptions... no checking for x86_64-pc-linux-gnu-gcc option to produce PIC... -fPIC -DPIC checking if x86_64-pc-linux-gnu-gcc PIC flag -fPIC -DPIC works... yes checking if x86_64-pc-linux-gnu-gcc static flag -static works... yes checking if x86_64-pc-linux-gnu-gcc supports -c -o file.o... yes checking if x86_64-pc-linux-gnu-gcc supports -c -o file.o... (cached) yes checking whether the x86_64-pc-linux-gnu-gcc linker (/usr/x86_64-pc-linux-gnu/bin/ld -m elf_x86_64) supports shared libraries... yes checking whether -lc should be explicitly linked in... no checking dynamic linker characteristics... GNU/Linux ld.so checking how to hardcode library paths into programs... immediate checking whether stripping libraries is possible... yes checking if libtool supports shared libraries... yes checking whether to build shared libraries... yes checking whether to build static libraries... no configure: creating ./config.lt config.lt: creating libtool checking for a Python interpreter with version >= 2.3... python checking for python... /usr/bin/python checking for python version... 2.7 checking for python platform... linux2 checking for python script directory... ${prefix}/lib64/python2.7/site-packages checking for python extension module directory... ${exec_prefix}/lib64/python2.7/site-packages checking for headers required to compile python extensions... found checking for x86_64-pc-linux-gnu-pkg-config... no checking for pkg-config... /usr/bin/pkg-config checking pkg-config is at least version 0.9.0... yes checking for PYGTK... yes checking for pygtk-codegen-2.0... /usr/bin/pygtk-codegen-2.0 checking for conflicting pygtk versions... none checking for pygobject defs... /usr/share/pygobject/2.0/defs checking for pygtk defs... /usr/share/pygtk/2.0/defs checking for gnome-python defs... /usr/share/pygtk/2.0/defs checking for gnome-python argtypes dir... /usr/share/pygtk/2.0/argtypes checking for x86_64-pc-linux-gnu-pkg-config... /usr/bin/pkg-config checking pkg-config is at least version 0.16... yes checking for GLIB - version >= 2.6.0... yes (version 2.28.8) checking for pkg-config... (cached) /usr/bin/pkg-config checking for GTK+ - version >= 2.4.0... yes (version 2.24.4) checking for LIBPANELAPPLET... yes checking whether x86_64-pc-linux-gnu-gcc understands -Wall... yes checking whether x86_64-pc-linux-gnu-gcc understands -std=c9x... yes checking whether x86_64-pc-linux-gnu-gcc understands -fno-strict-aliasing... yes configure: creating ./config.status config.status: creating Makefile config.status: creating gnomeapplet/Makefile config.status: creating gnomeprint/Makefile config.status: creating gtksourceview/Makefile config.status: creating wnck/Makefile config.status: creating totem/Makefile config.status: creating gtop/Makefile config.status: creating nautilusburn/Makefile config.status: creating braseromedia/Makefile config.status: creating braseroburn/Makefile config.status: creating mediaprofiles/Makefile config.status: creating metacity/Makefile config.status: creating rsvg/Makefile config.status: creating gnomekeyring/Makefile config.status: creating gnomedesktop/Makefile config.status: creating evolution/Makefile config.status: creating evince/Makefile config.status: creating gnome-python-desktop-2.0.pc config.status: creating tests/Makefile config.status: creating docs/Makefile config.status: creating docs/gtksourceview/Makefile config.status: creating docs/gnomeprint/Makefile config.status: creating docs/gnomeprintui/Makefile config.status: creating config.h config.status: executing depfiles commands config.status: executing libtool commands The following modules will be built: gnomeapplet The following modules will NOT be built: gnomeprint gnomeprint.ui gtksourceview wnck totem.plparser gtop nautilusburn braseromedia braseroburn mediaprofiles metacity rsvg gnomekeyring gnomedesktop bugbuddy evolution evolution ecal support evince ***************************************************************************** *** WARNING: You are using a deprecated build system (autotools). *** You should be using WAF instead; see the file INSTALL.WAF. *** The autotools build system will be removed in a future version. ***************************************************************************** >>> Source configured. >>> Compiling source in /var/tmp/portage/dev-python/gnome-applets-python-2.32.0/work/gnome-python-desktop-2.32.0 ... * Building of dev-python/gnome-applets-python-2.32.0 with CPython 2.7... make make all-recursive make[1]: Entering directory `/var/tmp/portage/dev-python/gnome-applets-python-2.32.0/work/gnome-python-desktop-2.32.0-2.7' Making all in docs make[2]: Entering directory `/var/tmp/portage/dev-python/gnome-applets-python-2.32.0/work/gnome-python-desktop-2.32.0-2.7/docs' make[3]: Entering directory `/var/tmp/portage/dev-python/gnome-applets-python-2.32.0/work/gnome-python-desktop-2.32.0-2.7/docs' make[3]: Nothing to be done for `all-am'. make[3]: Leaving directory `/var/tmp/portage/dev-python/gnome-applets-python-2.32.0/work/gnome-python-desktop-2.32.0-2.7/docs' make[2]: Leaving directory `/var/tmp/portage/dev-python/gnome-applets-python-2.32.0/work/gnome-python-desktop-2.32.0-2.7/docs' Making all in gnomeapplet make[2]: Entering directory `/var/tmp/portage/dev-python/gnome-applets-python-2.32.0/work/gnome-python-desktop-2.32.0-2.7/gnomeapplet' /bin/sh ../libtool --tag=CC --mode=compile x86_64-pc-linux-gnu-gcc -DHAVE_CONFIG_H -I. -I.. -I/usr/include/python2.7 -I/usr/include/python2.7 -pthread -I/usr/include/pygtk-2.0 -I/usr/include/gtk-2.0 -I/usr/include/glib-2.0 -I/usr/lib64/glib-2.0/include -I/usr/lib64/gtk-2.0/include -I/usr/include/atk-1.0 -I/usr/include/cairo -I/usr/include/gdk-pixbuf-2.0 -I/usr/include/pango-1.0 -I/usr/include/pixman-1 -I/usr/include/freetype2 -I/usr/include/libpng15 -DORBIT2=1 -pthread -D_REENTRANT -I/usr/include/panel-2.0 -I/usr/include/gconf/2 -I/usr/include/gtk-2.0 -I/usr/include/libbonoboui-2.0 -I/usr/include/orbit-2.0 -I/usr/include/glib-2.0 -I/usr/lib64/glib-2.0/include -I/usr/lib64/gtk-2.0/include -I/usr/include/atk-1.0 -I/usr/include/cairo -I/usr/include/gdk-pixbuf-2.0 -I/usr/include/pango-1.0 -I/usr/include/pixman-1 -I/usr/include/freetype2 -I/usr/include/libpng15 -I/usr/include/libxml2 -I/usr/include/libbonobo-2.0 -I/usr/include/libgnomecanvas-2.0 -I/usr/include/libgnome-2.0 -I/usr/include/bonobo-activation-2.0 -I/usr/include/gail-1.0 -I/usr/include/libart-2.0 -I/usr/include/gnome-vfs-2.0 -I/usr/lib64/gnome-vfs-2.0/include -I/usr/include/gnome-python-2.0 -I/usr/include/libgnomeui-2.0 -I/usr/include/gnome-keyring-1 -march=core2 -O2 -pipe -Wall -std=c9x -fno-strict-aliasing -MT gnomeapplet_la-appletmodule.lo -MD -MP -MF .deps/gnomeapplet_la-appletmodule.Tpo -c -o gnomeapplet_la-appletmodule.lo `test -f 'appletmodule.c' || echo './'`appletmodule.c libtool: compile: x86_64-pc-linux-gnu-gcc -DHAVE_CONFIG_H -I. -I.. -I/usr/include/python2.7 -I/usr/include/python2.7 -pthread -I/usr/include/pygtk-2.0 -I/usr/include/gtk-2.0 -I/usr/include/glib-2.0 -I/usr/lib64/glib-2.0/include -I/usr/lib64/gtk-2.0/include -I/usr/include/atk-1.0 -I/usr/include/cairo -I/usr/include/gdk-pixbuf-2.0 -I/usr/include/pango-1.0 -I/usr/include/pixman-1 -I/usr/include/freetype2 -I/usr/include/libpng15 -DORBIT2=1 -pthread -D_REENTRANT -I/usr/include/panel-2.0 -I/usr/include/gconf/2 -I/usr/include/gtk-2.0 -I/usr/include/libbonoboui-2.0 -I/usr/include/orbit-2.0 -I/usr/include/glib-2.0 -I/usr/lib64/glib-2.0/include -I/usr/lib64/gtk-2.0/include -I/usr/include/atk-1.0 -I/usr/include/cairo -I/usr/include/gdk-pixbuf-2.0 -I/usr/include/pango-1.0 -I/usr/include/pixman-1 -I/usr/include/freetype2 -I/usr/include/libpng15 -I/usr/include/libxml2 -I/usr/include/libbonobo-2.0 -I/usr/include/libgnomecanvas-2.0 -I/usr/include/libgnome-2.0 -I/usr/include/bonobo-activation-2.0 -I/usr/include/gail-1.0 -I/usr/include/libart-2.0 -I/usr/include/gnome-vfs-2.0 -I/usr/lib64/gnome-vfs-2.0/include -I/usr/include/gnome-python-2.0 -I/usr/include/libgnomeui-2.0 -I/usr/include/gnome-keyring-1 -march=core2 -O2 -pipe -Wall -std=c9x -fno-strict-aliasing -MT gnomeapplet_la-appletmodule.lo -MD -MP -MF .deps/gnomeapplet_la-appletmodule.Tpo -c appletmodule.c -fPIC -DPIC -o .libs/gnomeapplet_la-appletmodule.o mv -f .deps/gnomeapplet_la-appletmodule.Tpo .deps/gnomeapplet_la-appletmodule.Plo (cd . \ && /usr/bin/pygtk-codegen-2.0 \ --load-types /usr/share/pygtk/2.0/argtypes/bonobo-arg-types.py \ --py_ssize_t-clean \ --register /usr/share/pygtk/2.0/defs/pango-types.defs \ --register /usr/share/pygtk/2.0/defs/gdk-types.defs \ --register /usr/share/pygtk/2.0/defs/gtk-types.defs \ --register /usr/share/pygtk/2.0/defs/bonobo-types.defs \ --register /usr/share/pygtk/2.0/defs/bonoboui-types.defs \ --override applet.override \ --prefix pyapplet applet.defs) > gen-applet.c \ && cp gen-applet.c applet.c \ && rm -f gen-applet.c note: pygtk-codegen-2.0 is deprecated, use pygobject-codegen-2.0 instead note: I will now try to invoke pygobject-codegen-2.0 in the same directory Could not write function factory_main: No ArgType for PanelAppletFactoryCallback Could not write function panel_applet_shlib_factory: No ArgType for gpointer Could not write function panel_applet_shlib_factory_closure: No ArgType for gpointer Could not write function main: No ArgType for char*-argv Warning: Constructor for PanelApplet needs to be updated to new API See http://live.gnome.org/PyGTK_2fWhatsNew28#update-constructors ***INFO*** The coverage of global functions is 33.33% (2/6) ***INFO*** The coverage of methods is 100.00% (13/13) ***INFO*** There are no declared virtual proxies. ***INFO*** There are no declared virtual accessors. ***INFO*** There are no declared interface proxies. /bin/sh ../libtool --tag=CC --mode=compile x86_64-pc-linux-gnu-gcc -DHAVE_CONFIG_H -I. -I.. -I/usr/include/python2.7 -I/usr/include/python2.7 -pthread -I/usr/include/pygtk-2.0 -I/usr/include/gtk-2.0 -I/usr/include/glib-2.0 -I/usr/lib64/glib-2.0/include -I/usr/lib64/gtk-2.0/include -I/usr/include/atk-1.0 -I/usr/include/cairo -I/usr/include/gdk-pixbuf-2.0 -I/usr/include/pango-1.0 -I/usr/include/pixman-1 -I/usr/include/freetype2 -I/usr/include/libpng15 -DORBIT2=1 -pthread -D_REENTRANT -I/usr/include/panel-2.0 -I/usr/include/gconf/2 -I/usr/include/gtk-2.0 -I/usr/include/libbonoboui-2.0 -I/usr/include/orbit-2.0 -I/usr/include/glib-2.0 -I/usr/lib64/glib-2.0/include -I/usr/lib64/gtk-2.0/include -I/usr/include/atk-1.0 -I/usr/include/cairo -I/usr/include/gdk-pixbuf-2.0 -I/usr/include/pango-1.0 -I/usr/include/pixman-1 -I/usr/include/freetype2 -I/usr/include/libpng15 -I/usr/include/libxml2 -I/usr/include/libbonobo-2.0 -I/usr/include/libgnomecanvas-2.0 -I/usr/include/libgnome-2.0 -I/usr/include/bonobo-activation-2.0 -I/usr/include/gail-1.0 -I/usr/include/libart-2.0 -I/usr/include/gnome-vfs-2.0 -I/usr/lib64/gnome-vfs-2.0/include -I/usr/include/gnome-python-2.0 -I/usr/include/libgnomeui-2.0 -I/usr/include/gnome-keyring-1 -march=core2 -O2 -pipe -Wall -std=c9x -fno-strict-aliasing -MT gnomeapplet_la-applet.lo -MD -MP -MF .deps/gnomeapplet_la-applet.Tpo -c -o gnomeapplet_la-applet.lo `test -f 'applet.c' || echo './'`applet.c libtool: compile: x86_64-pc-linux-gnu-gcc -DHAVE_CONFIG_H -I. -I.. -I/usr/include/python2.7 -I/usr/include/python2.7 -pthread -I/usr/include/pygtk-2.0 -I/usr/include/gtk-2.0 -I/usr/include/glib-2.0 -I/usr/lib64/glib-2.0/include -I/usr/lib64/gtk-2.0/include -I/usr/include/atk-1.0 -I/usr/include/cairo -I/usr/include/gdk-pixbuf-2.0 -I/usr/include/pango-1.0 -I/usr/include/pixman-1 -I/usr/include/freetype2 -I/usr/include/libpng15 -DORBIT2=1 -pthread -D_REENTRANT -I/usr/include/panel-2.0 -I/usr/include/gconf/2 -I/usr/include/gtk-2.0 -I/usr/include/libbonoboui-2.0 -I/usr/include/orbit-2.0 -I/usr/include/glib-2.0 -I/usr/lib64/glib-2.0/include -I/usr/lib64/gtk-2.0/include -I/usr/include/atk-1.0 -I/usr/include/cairo -I/usr/include/gdk-pixbuf-2.0 -I/usr/include/pango-1.0 -I/usr/include/pixman-1 -I/usr/include/freetype2 -I/usr/include/libpng15 -I/usr/include/libxml2 -I/usr/include/libbonobo-2.0 -I/usr/include/libgnomecanvas-2.0 -I/usr/include/libgnome-2.0 -I/usr/include/bonobo-activation-2.0 -I/usr/include/gail-1.0 -I/usr/include/libart-2.0 -I/usr/include/gnome-vfs-2.0 -I/usr/lib64/gnome-vfs-2.0/include -I/usr/include/gnome-python-2.0 -I/usr/include/libgnomeui-2.0 -I/usr/include/gnome-keyring-1 -march=core2 -O2 -pipe -Wall -std=c9x -fno-strict-aliasing -MT gnomeapplet_la-applet.lo -MD -MP -MF .deps/gnomeapplet_la-applet.Tpo -c applet.c -fPIC -DPIC -o .libs/gnomeapplet_la-applet.o mv -f .deps/gnomeapplet_la-applet.Tpo .deps/gnomeapplet_la-applet.Plo /bin/sh ../libtool --tag=CC --mode=link x86_64-pc-linux-gnu-gcc -DORBIT2=1 -pthread -D_REENTRANT -I/usr/include/panel-2.0 -I/usr/include/gconf/2 -I/usr/include/gtk-2.0 -I/usr/include/libbonoboui-2.0 -I/usr/include/orbit-2.0 -I/usr/include/glib-2.0 -I/usr/lib64/glib-2.0/include -I/usr/lib64/gtk-2.0/include -I/usr/include/atk-1.0 -I/usr/include/cairo -I/usr/include/gdk-pixbuf-2.0 -I/usr/include/pango-1.0 -I/usr/include/pixman-1 -I/usr/include/freetype2 -I/usr/include/libpng15 -I/usr/include/libxml2 -I/usr/include/libbonobo-2.0 -I/usr/include/libgnomecanvas-2.0 -I/usr/include/libgnome-2.0 -I/usr/include/bonobo-activation-2.0 -I/usr/include/gail-1.0 -I/usr/include/libart-2.0 -I/usr/include/gnome-vfs-2.0 -I/usr/lib64/gnome-vfs-2.0/include -I/usr/include/gnome-python-2.0 -I/usr/include/libgnomeui-2.0 -I/usr/include/gnome-keyring-1 -march=core2 -O2 -pipe -Wall -std=c9x -fno-strict-aliasing -module -avoid-version -export-symbols-regex initgnomeapplet -Wl,-O1 -Wl,--as-needed -o gnomeapplet.la -rpath /usr/lib64/python2.7/site-packages/gtk-2.0 gnomeapplet_la-appletmodule.lo gnomeapplet_la-applet.lo -pthread -lpanel-applet-2 -lgnomeui-2 -lSM -lICE -lbonoboui-2 -lgnomevfs-2 -lgnomecanvas-2 -lgnome-2 -lpopt -lbonobo-2 -lbonobo-activation -lORBit-2 -lart_lgpl_2 -lgtk-x11-2.0 -lgdk-x11-2.0 -latk-1.0 -lgio-2.0 -lpangoft2-1.0 -lpangocairo-1.0 -lgdk_pixbuf-2.0 -lcairo -lpango-1.0 -lfreetype -lfontconfig -lgconf-2 -lgmodule-2.0 -lgobject-2.0 -lgthread-2.0 -lrt -lglib-2.0 libtool: link: /usr/bin/nm -B .libs/gnomeapplet_la-appletmodule.o .libs/gnomeapplet_la-applet.o | sed -n -e 's/^.*[ ]\([ABCDGIRSTW][ABCDGIRSTW]*\)[ ][ ]*\([_A-Za-z][_A-Za-z0-9]*\)$/\1 \2 \2/p' | /bin/sed 's/.* //' | sort | uniq > .libs/gnomeapplet.exp libtool: link: /bin/grep -E -e "initgnomeapplet" ".libs/gnomeapplet.exp" > ".libs/gnomeapplet.expT" libtool: link: mv -f ".libs/gnomeapplet.expT" ".libs/gnomeapplet.exp" libtool: link: echo "{ global:" > .libs/gnomeapplet.ver libtool: link: cat .libs/gnomeapplet.exp | sed -e "s/\(.*\)/\1;/" >> .libs/gnomeapplet.ver libtool: link: echo "local: *; };" >> .libs/gnomeapplet.ver libtool: link: x86_64-pc-linux-gnu-gcc -shared .libs/gnomeapplet_la-appletmodule.o .libs/gnomeapplet_la-applet.o -Wl,--as-needed -lpanel-applet-2 /usr/lib64/libgnomeui-2.so -L/usr/lib64 -lpng14 /usr/lib64/libgnome-keyring.so /usr/lib64/libgcrypt.so /usr/lib64/libgpg-error.so -lX11 -lSM -lICE -lbonoboui-2 /usr/lib64/libgnomevfs-2.so -lxml2 -ldbus-glib-1 -ldbus-1 -lpthread -lssl -lcrypto -ldl -lresolv -lutil -lgnomecanvas-2 -lgnome-2 -lpopt /usr/lib64/libbonobo-2.so /usr/lib64/libbonobo-activation.so /usr/lib64/libORBitCosNaming-2.so /usr/lib64/libORBit-2.so /usr/lib64/libart_lgpl_2.so -lm /usr/lib64/libgtk-x11-2.0.so /usr/lib64/ libgdk-x11-2.0.so /usr/lib64/libatk-1.0.so -lgio-2.0 -lpangoft2-1.0 -lpangocairo-1.0 -lgdk_pixbuf-2.0 -lcairo -lpango-1.0 /usr/lib64/libfontconfig.so -lfreetype -lz -lbz2 -lexpat -lgconf-2 -lgmodule-2.0 -lgobject-2.0 -lgthread-2.0 -lrt -lglib-2.0 -pthread -march=core2 -Wl,-O1 -pthread -pthread -Wl,-soname -Wl,gnomeapplet.so -Wl,-version-script -Wl,.libs/gnomeapplet.ver -o .libs/gnomeapplet.so /usr/lib/gcc/x86_64-pc-linux-gnu/4.4.5/../../../../x86_64-pc-linux-gnu/bin/ld: cannot find -lpng14 collect2: ld returned 1 exit status make[2]: *** [gnomeapplet.la] Error 1 make[2]: Leaving directory `/var/tmp/portage/dev-python/gnome-applets-python-2.32.0/work/gnome-python-desktop-2.32.0-2.7/gnomeapplet' make[1]: *** [all-recursive] Error 1 make[1]: Leaving directory `/var/tmp/portage/dev-python/gnome-applets-python-2.32.0/work/gnome-python-desktop-2.32.0-2.7' make: *** [all] Error 2 emake failed [31;01m* [0m ERROR: dev-python/gnome-applets-python-2.32.0 failed (compile phase): [31;01m* [0m Building failed with CPython 2.7 in python_default_function() function [31;01m* [0m [31;01m* [0m Call stack: [31;01m* [0m ebuild.sh, line 56: Called src_compile [31;01m* [0m environment, line 6045: Called gnome-python-common_src_compile [31;01m* [0m environment, line 3099: Called python_src_compile [31;01m* [0m environment, line 5899: Called python_execute_function '-d' '-s' '--' [31;01m* [0m environment, line 4352: Called die [31;01m* [0m The specific snippet of code: [31;01m* [0m die "${failure_message}"; [31;01m* [0m [31;01m* [0m If you need support, post the output of 'emerge --info =dev-python/gnome-applets-python-2.32.0', [31;01m* [0m the complete build log and the output of 'emerge -pqv =dev-python/gnome-applets-python-2.32.0'. [31;01m* [0m The complete build log is located at '/var/tmp/portage/dev-python/gnome-applets-python-2.32.0/temp/build.log'. [31;01m* [0m The ebuild environment file is located at '/var/tmp/portage/dev-python/gnome-applets-python-2.32.0/temp/environment'. [31;01m* [0m S: '/var/tmp/portage/dev-python/gnome-applets-python-2.32.0/work/gnome-python-desktop-2.32.0' 2011/10/21 Jonas de Buhr <jonas.de.buhr@gmx.net> > just give the *full* output of the emerge command you ran. > > Am 21.10.2011 10:03, schrieb co: > >> Thankyou, I found this >> [SNIP] >> >> > > [-- Attachment #2: Type: text/html, Size: 26403 bytes --] ^ permalink raw reply [flat|nested] 9+ messages in thread
* [gentoo-user] Re: [gentoo-user] Re: [gentoo-user] Re: [gentoo-user] Re: [gentoo-user] Fwd: gnome-applets-python 装不上 2011-10-21 9:15 ` [gentoo-user] " co @ 2011-10-21 9:38 ` Jonas de Buhr 2011-10-21 9:48 ` [gentoo-user] " co 2011-10-21 9:40 ` Dale 1 sibling, 1 reply; 9+ messages in thread From: Jonas de Buhr @ 2011-10-21 9:38 UTC (permalink / raw To: gentoo-user Am 21.10.2011 11:15, schrieb co: > [SNIP] > libtool: link: mv -f ".libs/gnomeapplet.expT" ".libs/gnomeapplet.exp" > libtool: link: echo "{ global:"> .libs/gnomeapplet.ver > libtool: link: cat .libs/gnomeapplet.exp | sed -e "s/\(.*\)/\1;/">> > .libs/gnomeapplet.ver > libtool: link: echo "local: *; };">> .libs/gnomeapplet.ver > libtool: link: x86_64-pc-linux-gnu-gcc -shared > .libs/gnomeapplet_la-appletmodule.o .libs/gnomeapplet_la-applet.o > -Wl,--as-needed -lpanel-applet-2 /usr/lib64/libgnomeui-2.so -L/usr/lib64 > -lpng14 /usr/lib64/libgnome-keyring.so /usr/lib64/libgcrypt.so > /usr/lib64/libgpg-error.so -lX11 -lSM -lICE -lbonoboui-2 > /usr/lib64/libgnomevfs-2.so -lxml2 -ldbus-glib-1 -ldbus-1 -lpthread -lssl > -lcrypto -ldl -lresolv -lutil -lgnomecanvas-2 -lgnome-2 -lpopt > /usr/lib64/libbonobo-2.so /usr/lib64/libbonobo-activation.so > /usr/lib64/libORBitCosNaming-2.so /usr/lib64/libORBit-2.so > /usr/lib64/libart_lgpl_2.so -lm /usr/lib64/libgtk-x11-2.0.so /usr/lib64/ > libgdk-x11-2.0.so /usr/lib64/libatk-1.0.so -lgio-2.0 -lpangoft2-1.0 > -lpangocairo-1.0 -lgdk_pixbuf-2.0 -lcairo -lpango-1.0 > /usr/lib64/libfontconfig.so -lfreetype -lz -lbz2 -lexpat -lgconf-2 > -lgmodule-2.0 -lgobject-2.0 -lgthread-2.0 -lrt -lglib-2.0 -pthread > -march=core2 -Wl,-O1 -pthread -pthread -Wl,-soname -Wl,gnomeapplet.so > -Wl,-version-script -Wl,.libs/gnomeapplet.ver -o .libs/gnomeapplet.so > /usr/lib/gcc/x86_64-pc-linux-gnu/4.4.5/../../../../x86_64-pc-linux-gnu/bin/ld: > cannot find -lpng14 libpng14 doesn't exist. probably because it was updated and broken .la files are still present. eselect news list and read the item about libpng15. everything you neeed to do is described there. short version: delete all .la files under /usr/ which contain "png14" then do revdep-rebuild. > collect2: ld returned 1 exit status > [SNIP] > > 2011/10/21 Jonas de Buhr<jonas.de.buhr@gmx.net> > >> just give the *full* output of the emerge command you ran. >> >> Am 21.10.2011 10:03, schrieb co: >> >>> Thankyou, I found this >>> [SNIP] >>> >>> >> >> > ^ permalink raw reply [flat|nested] 9+ messages in thread
* [gentoo-user] Re: [gentoo-user] Re: [gentoo-user] Re: [gentoo-user] Re: [gentoo-user] Re: [gentoo-user] Fwd: gnome-applets-python 装不上 2011-10-21 9:38 ` [gentoo-user] " Jonas de Buhr @ 2011-10-21 9:48 ` co 0 siblings, 0 replies; 9+ messages in thread From: co @ 2011-10-21 9:48 UTC (permalink / raw To: gentoo-user [-- Attachment #1: Type: text/plain, Size: 2220 bytes --] Thank you so muck! 2011/10/21 Jonas de Buhr <jonas.de.buhr@gmx.net> > Am 21.10.2011 11:15, schrieb co: > >> [SNIP] >> >> libtool: link: mv -f ".libs/gnomeapplet.expT" ".libs/gnomeapplet.exp" >> libtool: link: echo "{ global:"> .libs/gnomeapplet.ver >> libtool: link: cat .libs/gnomeapplet.exp | sed -e "s/\(.*\)/\1;/">> >> .libs/gnomeapplet.ver >> libtool: link: echo "local: *; };">> .libs/gnomeapplet.ver >> libtool: link: x86_64-pc-linux-gnu-gcc -shared >> .libs/gnomeapplet_la-**appletmodule.o .libs/gnomeapplet_la-applet.o >> -Wl,--as-needed -lpanel-applet-2 /usr/lib64/libgnomeui-2.so -L/usr/lib64 >> -lpng14 /usr/lib64/libgnome-keyring.so /usr/lib64/libgcrypt.so >> /usr/lib64/libgpg-error.so -lX11 -lSM -lICE -lbonoboui-2 >> /usr/lib64/libgnomevfs-2.so -lxml2 -ldbus-glib-1 -ldbus-1 -lpthread -lssl >> -lcrypto -ldl -lresolv -lutil -lgnomecanvas-2 -lgnome-2 -lpopt >> /usr/lib64/libbonobo-2.so /usr/lib64/libbonobo-**activation.so >> /usr/lib64/libORBitCosNaming-**2.so /usr/lib64/libORBit-2.so >> /usr/lib64/libart_lgpl_2.so -lm /usr/lib64/libgtk-x11-2.0.so /usr/lib64/ >> libgdk-x11-2.0.so /usr/lib64/libatk-1.0.so -lgio-2.0 -lpangoft2-1.0 >> -lpangocairo-1.0 -lgdk_pixbuf-2.0 -lcairo -lpango-1.0 >> /usr/lib64/libfontconfig.so -lfreetype -lz -lbz2 -lexpat -lgconf-2 >> -lgmodule-2.0 -lgobject-2.0 -lgthread-2.0 -lrt -lglib-2.0 -pthread >> -march=core2 -Wl,-O1 -pthread -pthread -Wl,-soname -Wl,gnomeapplet.so >> -Wl,-version-script -Wl,.libs/gnomeapplet.ver -o .libs/gnomeapplet.so >> /usr/lib/gcc/x86_64-pc-linux-**gnu/4.4.5/../../../../x86_64-** >> pc-linux-gnu/bin/ld: >> cannot find -lpng14 >> > > libpng14 doesn't exist. probably because it was updated and broken .la > files are still present. > > eselect news list > > and read the item about libpng15. > everything you neeed to do is described there. short version: delete all > .la files under /usr/ which contain "png14" then do revdep-rebuild. > > > > collect2: ld returned 1 exit status >> [SNIP] >> >> >> 2011/10/21 Jonas de Buhr<jonas.de.buhr@gmx.net> >> >> just give the *full* output of the emerge command you ran. >>> >>> Am 21.10.2011 10:03, schrieb co: >>> >>> Thankyou, I found this >>>> [SNIP] >>>> >>>> >>>> >>> >>> >> > > [-- Attachment #2: Type: text/html, Size: 3428 bytes --] ^ permalink raw reply [flat|nested] 9+ messages in thread
* [gentoo-user] Re: [gentoo-user] Re: [gentoo-user] Re: [gentoo-user] Re: [gentoo-user] Fwd: gnome-applets-python 装不上 2011-10-21 9:15 ` [gentoo-user] " co 2011-10-21 9:38 ` [gentoo-user] " Jonas de Buhr @ 2011-10-21 9:40 ` Dale 2011-10-21 9:49 ` [gentoo-user] " co 1 sibling, 1 reply; 9+ messages in thread From: Dale @ 2011-10-21 9:40 UTC (permalink / raw To: gentoo-user [-- Attachment #1: Type: text/plain, Size: 3449 bytes --] co wrote: > build.log > [32;01m * [39;49;00mPackage: dev-python/gnome-applets-python-2.32.0 > <<< SNIP >>> > libtool: link: x86_64-pc-linux-gnu-gcc -shared > .libs/gnomeapplet_la-appletmodule.o .libs/gnomeapplet_la-applet.o > -Wl,--as-needed -lpanel-applet-2 /usr/lib64/libgnomeui-2.so > -L/usr/lib64 -lpng14 /usr/lib64/libgnome-keyring.so > /usr/lib64/libgcrypt.so /usr/lib64/libgpg-error.so -lX11 -lSM -lICE > -lbonoboui-2 /usr/lib64/libgnomevfs-2.so -lxml2 -ldbus-glib-1 -ldbus-1 > -lpthread -lssl -lcrypto -ldl -lresolv -lutil -lgnomecanvas-2 > -lgnome-2 -lpopt /usr/lib64/libbonobo-2.so > /usr/lib64/libbonobo-activation.so /usr/lib64/libORBitCosNaming-2.so > /usr/lib64/libORBit-2.so /usr/lib64/libart_lgpl_2.so -lm > /usr/lib64/libgtk-x11-2.0.so <http://libgtk-x11-2.0.so> > /usr/lib64/libgdk-x11-2.0.so <http://libgdk-x11-2.0.so> > /usr/lib64/libatk-1.0.so <http://libatk-1.0.so> -lgio-2.0 > -lpangoft2-1.0 -lpangocairo-1.0 -lgdk_pixbuf-2.0 -lcairo -lpango-1.0 > /usr/lib64/libfontconfig.so -lfreetype -lz -lbz2 -lexpat -lgconf-2 > -lgmodule-2.0 -lgobject-2.0 -lgthread-2.0 -lrt -lglib-2.0 -pthread > -march=core2 -Wl,-O1 -pthread -pthread -Wl,-soname > -Wl,gnomeapplet.so -Wl,-version-script -Wl,.libs/gnomeapplet.ver -o > .libs/gnomeapplet.so > /usr/lib/gcc/x86_64-pc-linux-gnu/4.4.5/../../../../x86_64-pc-linux-gnu/bin/ld: > cannot find -lpng14 > collect2: ld returned 1 exit status > make[2]: *** [gnomeapplet.la <http://gnomeapplet.la>] Error 1 > make[2]: Leaving directory > `/var/tmp/portage/dev-python/gnome-applets-python-2.32.0/work/gnome-python-desktop-2.32.0-2.7/gnomeapplet' > make[1]: *** [all-recursive] Error 1 > make[1]: Leaving directory > `/var/tmp/portage/dev-python/gnome-applets-python-2.32.0/work/gnome-python-desktop-2.32.0-2.7' > make: *** [all] Error 2 > emake failed > [31;01m* [0m ERROR: dev-python/gnome-applets-python-2.32.0 failed > (compile phase): > [31;01m* [0m Building failed with CPython 2.7 in > python_default_function() function > [31;01m* [0m > [31;01m* [0m Call stack: > [31;01m* [0m ebuild.sh, line 56: Called src_compile > [31;01m* [0m environment, line 6045: Called > gnome-python-common_src_compile > [31;01m* [0m environment, line 3099: Called python_src_compile > [31;01m* [0m environment, line 5899: Called > python_execute_function '-d' '-s' '--' > [31;01m* [0m environment, line 4352: Called die > [31;01m* [0m The specific snippet of code: > [31;01m* [0m die "${failure_message}"; > [31;01m* [0m > [31;01m* [0m If you need support, post the output of 'emerge --info > =dev-python/gnome-applets-python-2.32.0', > [31;01m* [0m the complete build log and the output of 'emerge -pqv > =dev-python/gnome-applets-python-2.32.0'. > [31;01m* [0m The complete build log is located at > '/var/tmp/portage/dev-python/gnome-applets-python-2.32.0/temp/build.log'. > [31;01m* [0m The ebuild environment file is located at > '/var/tmp/portage/dev-python/gnome-applets-python-2.32.0/temp/environment'. > [31;01m* [0m S: > '/var/tmp/portage/dev-python/gnome-applets-python-2.32.0/work/gnome-python-desktop-2.32.0' > > Try this command: revdep-rebuild --library libpng14.so.14 -- --keep-going There is a news item about this error. This should help: eselect news list then eselect news read <number here> The news item is "Upgrade to libpng15". Hope that helps. Dale :-) :-) [-- Attachment #2: Type: text/html, Size: 5051 bytes --] ^ permalink raw reply [flat|nested] 9+ messages in thread
* [gentoo-user] Re: [gentoo-user] Re: [gentoo-user] Re: [gentoo-user] Re: [gentoo-user] Re: [gentoo-user] Fwd: gnome-applets-python 装不上 2011-10-21 9:40 ` Dale @ 2011-10-21 9:49 ` co 0 siblings, 0 replies; 9+ messages in thread From: co @ 2011-10-21 9:49 UTC (permalink / raw To: gentoo-user [-- Attachment #1: Type: text/plain, Size: 3412 bytes --] Thanks for you too 2011/10/21 Dale <rdalek1967@gmail.com> > co wrote: > > build.log > [32;01m * [39;49;00mPackage: dev-python/gnome-applets-python-2.32.0 > <<< SNIP >>> > libtool: link: x86_64-pc-linux-gnu-gcc -shared > .libs/gnomeapplet_la-appletmodule.o .libs/gnomeapplet_la-applet.o > -Wl,--as-needed -lpanel-applet-2 /usr/lib64/libgnomeui-2.so -L/usr/lib64 > -lpng14 /usr/lib64/libgnome-keyring.so /usr/lib64/libgcrypt.so > /usr/lib64/libgpg-error.so -lX11 -lSM -lICE -lbonoboui-2 > /usr/lib64/libgnomevfs-2.so -lxml2 -ldbus-glib-1 -ldbus-1 -lpthread -lssl > -lcrypto -ldl -lresolv -lutil -lgnomecanvas-2 -lgnome-2 -lpopt > /usr/lib64/libbonobo-2.so /usr/lib64/libbonobo-activation.so > /usr/lib64/libORBitCosNaming-2.so /usr/lib64/libORBit-2.so > /usr/lib64/libart_lgpl_2.so -lm /usr/lib64/libgtk-x11-2.0.so /usr/lib64/ > libgdk-x11-2.0.so /usr/lib64/libatk-1.0.so -lgio-2.0 -lpangoft2-1.0 > -lpangocairo-1.0 -lgdk_pixbuf-2.0 -lcairo -lpango-1.0 > /usr/lib64/libfontconfig.so -lfreetype -lz -lbz2 -lexpat -lgconf-2 > -lgmodule-2.0 -lgobject-2.0 -lgthread-2.0 -lrt -lglib-2.0 -pthread > -march=core2 -Wl,-O1 -pthread -pthread -Wl,-soname -Wl,gnomeapplet.so > -Wl,-version-script -Wl,.libs/gnomeapplet.ver -o .libs/gnomeapplet.so > /usr/lib/gcc/x86_64-pc-linux-gnu/4.4.5/../../../../x86_64-pc-linux-gnu/bin/ld: > cannot find -lpng14 > collect2: ld returned 1 exit status > make[2]: *** [gnomeapplet.la] Error 1 > make[2]: Leaving directory > `/var/tmp/portage/dev-python/gnome-applets-python-2.32.0/work/gnome-python-desktop-2.32.0-2.7/gnomeapplet' > make[1]: *** [all-recursive] Error 1 > make[1]: Leaving directory > `/var/tmp/portage/dev-python/gnome-applets-python-2.32.0/work/gnome-python-desktop-2.32.0-2.7' > make: *** [all] Error 2 > emake failed > [31;01m* [0m ERROR: dev-python/gnome-applets-python-2.32.0 failed > (compile phase): > [31;01m* [0m Building failed with CPython 2.7 in > python_default_function() function > [31;01m* [0m > [31;01m* [0m Call stack: > [31;01m* [0m ebuild.sh, line 56: Called src_compile > [31;01m* [0m environment, line 6045: Called > gnome-python-common_src_compile > [31;01m* [0m environment, line 3099: Called python_src_compile > [31;01m* [0m environment, line 5899: Called python_execute_function > '-d' '-s' '--' > [31;01m* [0m environment, line 4352: Called die > [31;01m* [0m The specific snippet of code: > [31;01m* [0m die "${failure_message}"; > [31;01m* [0m > [31;01m* [0m If you need support, post the output of 'emerge --info > =dev-python/gnome-applets-python-2.32.0', > [31;01m* [0m the complete build log and the output of 'emerge -pqv > =dev-python/gnome-applets-python-2.32.0'. > [31;01m* [0m The complete build log is located at > '/var/tmp/portage/dev-python/gnome-applets-python-2.32.0/temp/build.log'. > [31;01m* [0m The ebuild environment file is located at > '/var/tmp/portage/dev-python/gnome-applets-python-2.32.0/temp/environment'. > [31;01m* [0m S: > '/var/tmp/portage/dev-python/gnome-applets-python-2.32.0/work/gnome-python-desktop-2.32.0' > > > > Try this command: > > revdep-rebuild --library libpng14.so.14 -- --keep-going > > There is a news item about this error. This should help: > > eselect news list > > then > > eselect news read <number here> > > The news item is "Upgrade to libpng15". > > Hope that helps. > > Dale > > :-) :-) > > > [-- Attachment #2: Type: text/html, Size: 5218 bytes --] ^ permalink raw reply [flat|nested] 9+ messages in thread
end of thread, other threads:[~2011-10-21 9:51 UTC | newest] Thread overview: 9+ messages (download: mbox.gz follow: Atom feed -- links below jump to the message on this page -- [not found] <CAChzKCq_7xGWz_Pq5cOTGVzquHY0rw5-9tpWDchOjtxRVXLwUQ@mail.gmail.com> 2011-10-21 6:57 ` [gentoo-user] Fwd: gnome-applets-python 装不上 co 2011-10-21 7:40 ` Dale 2011-10-21 8:03 ` [gentoo-user] " co 2011-10-21 9:07 ` [gentoo-user] " Jonas de Buhr 2011-10-21 9:15 ` [gentoo-user] " co 2011-10-21 9:38 ` [gentoo-user] " Jonas de Buhr 2011-10-21 9:48 ` [gentoo-user] " co 2011-10-21 9:40 ` Dale 2011-10-21 9:49 ` [gentoo-user] " co
This is a public inbox, see mirroring instructions for how to clone and mirror all data and code used for this inbox