From: catalyst@demeter.amd64.dev.gentoo.org
To: releng@gentoo.org,gentoo-releng-autobuilds@lists.gentoo.org
Subject: [gentoo-releng-autobuilds] [m68k-qemu-auto] Catalyst fatal build error - stage1-openrc.spec
Date: Wed, 2 Mar 2022 23:04:38 +0000 (UTC) [thread overview]
Message-ID: <20220302230438.E40BF2680EB@demeter.amd64.dev.gentoo.org> (raw)
m68k-unknown-linux-gnu-gcc -fPIC -Wno-unused-result -Wsign-compare -DNDEBUG -pipe -O2 -fwrapv -std=c99 -Wextra -Wno-unused-result -Wno-unused-parameter -Wno-missing-field-initializers -Wstrict-prototypes -Werror=implicit-function-declaration -fvisibility=hidden -I./Include/internal -DCONFIG_32=1 -DANSI=1 -I/var/tmp/portage/dev-lang/python-3.10.2-r1/work/Python-3.10.2/Modules/_decimal/libmpdec -I./Include -I. -I/usr/include/ncursesw -I/var/tmp/portage/dev-lang/python-3.10.2-r1/work/Python-3.10.2/Include -I/var/tmp/portage/dev-lang/python-3.10.2-r1/work/Python-3.10.2 -c /var/tmp/portage/dev-lang/python-3.10.2-r1/work/Python-3.10.2/Modules/_decimal/libmpdec/difradix2.c -o build/temp.linux-m68k-3.10/var/tmp/portage/dev-lang/python-3.10.2-r1/work/Python-3.10.2/Modules/_decimal/libmpdec/difradix2.o
m68k-unknown-linux-gnu-gcc -shared -Wl,-O1 -Wl,--as-needed -Wno-unused-result -Wsign-compare -DNDEBUG build/temp.linux-m68k-3.10/var/tmp/portage/dev-lang/python-3.10.2-r1/work/Python-3.10.2/Modules/_ctypes/_ctypes.o build/temp.linux-m68k-3.10/var/tmp/portage/dev-lang/python-3.10.2-r1/work/Python-3.10.2/Modules/_ctypes/callbacks.o build/temp.linux-m68k-3.10/var/tmp/portage/dev-lang/python-3.10.2-r1/work/Python-3.10.2/Modules/_ctypes/callproc.o build/temp.linux-m68k-3.10/var/tmp/portage/dev-lang/python-3.10.2-r1/work/Python-3.10.2/Modules/_ctypes/cfield.o build/temp.linux-m68k-3.10/var/tmp/portage/dev-lang/python-3.10.2-r1/work/Python-3.10.2/Modules/_ctypes/stgdict.o -L. -L/usr/local/lib -lffi -ldl -o build/lib.linux-m68k-3.10/_ctypes.cpython-310-m68k-linux-gnu.so
m68k-unknown-linux-gnu-gcc -fPIC -Wno-unused-result -Wsign-compare -DNDEBUG -pipe -O2 -fwrapv -std=c99 -Wextra -Wno-unused-result -Wno-unused-parameter -Wno-missing-field-initializers -Wstrict-prototypes -Werror=implicit-function-declaration -fvisibility=hidden -I./Include/internal -DCONFIG_32=1 -DANSI=1 -I/var/tmp/portage/dev-lang/python-3.10.2-r1/work/Python-3.10.2/Modules/_decimal/libmpdec -I./Include -I. -I/usr/include/ncursesw -I/var/tmp/portage/dev-lang/python-3.10.2-r1/work/Python-3.10.2/Include -I/var/tmp/portage/dev-lang/python-3.10.2-r1/work/Python-3.10.2 -c /var/tmp/portage/dev-lang/python-3.10.2-r1/work/Python-3.10.2/Modules/_decimal/libmpdec/fnt.c -o build/temp.linux-m68k-3.10/var/tmp/portage/dev-lang/python-3.10.2-r1/work/Python-3.10.2/Modules/_decimal/libmpdec/fnt.o
m68k-unknown-linux-gnu-gcc -fPIC -Wno-unused-result -Wsign-compare -DNDEBUG -pipe -O2 -fwrapv -std=c99 -Wextra -Wno-unused-result -Wno-unused-parameter -Wno-missing-field-initializers -Wstrict-prototypes -Werror=implicit-function-declaration -fvisibility=hidden -I./Include/internal -DCONFIG_32=1 -DANSI=1 -I/var/tmp/portage/dev-lang/python-3.10.2-r1/work/Python-3.10.2/Modules/_decimal/libmpdec -I./Include -I. -I/usr/include/ncursesw -I/var/tmp/portage/dev-lang/python-3.10.2-r1/work/Python-3.10.2/Include -I/var/tmp/portage/dev-lang/python-3.10.2-r1/work/Python-3.10.2 -c /var/tmp/portage/dev-lang/python-3.10.2-r1/work/Python-3.10.2/Modules/_decimal/libmpdec/fourstep.c -o build/temp.linux-m68k-3.10/var/tmp/portage/dev-lang/python-3.10.2-r1/work/Python-3.10.2/Modules/_decimal/libmpdec/fourstep.o
m68k-unknown-linux-gnu-gcc -fPIC -Wno-unused-result -Wsign-compare -DNDEBUG -pipe -O2 -fwrapv -std=c99 -Wextra -Wno-unused-result -Wno-unused-parameter -Wno-missing-field-initializers -Wstrict-prototypes -Werror=implicit-function-declaration -fvisibility=hidden -I./Include/internal -DCONFIG_32=1 -DANSI=1 -I/var/tmp/portage/dev-lang/python-3.10.2-r1/work/Python-3.10.2/Modules/_decimal/libmpdec -I./Include -I. -I/usr/include/ncursesw -I/var/tmp/portage/dev-lang/python-3.10.2-r1/work/Python-3.10.2/Include -I/var/tmp/portage/dev-lang/python-3.10.2-r1/work/Python-3.10.2 -c /var/tmp/portage/dev-lang/python-3.10.2-r1/work/Python-3.10.2/Modules/_decimal/libmpdec/io.c -o build/temp.linux-m68k-3.10/var/tmp/portage/dev-lang/python-3.10.2-r1/work/Python-3.10.2/Modules/_decimal/libmpdec/io.o
m68k-unknown-linux-gnu-gcc -fPIC -Wno-unused-result -Wsign-compare -DNDEBUG -pipe -O2 -fwrapv -std=c99 -Wextra -Wno-unused-result -Wno-unused-parameter -Wno-missing-field-initializers -Wstrict-prototypes -Werror=implicit-function-declaration -fvisibility=hidden -I./Include/internal -DCONFIG_32=1 -DANSI=1 -I/var/tmp/portage/dev-lang/python-3.10.2-r1/work/Python-3.10.2/Modules/_decimal/libmpdec -I./Include -I. -I/usr/include/ncursesw -I/var/tmp/portage/dev-lang/python-3.10.2-r1/work/Python-3.10.2/Include -I/var/tmp/portage/dev-lang/python-3.10.2-r1/work/Python-3.10.2 -c /var/tmp/portage/dev-lang/python-3.10.2-r1/work/Python-3.10.2/Modules/_decimal/libmpdec/mpalloc.c -o build/temp.linux-m68k-3.10/var/tmp/portage/dev-lang/python-3.10.2-r1/work/Python-3.10.2/Modules/_decimal/libmpdec/mpalloc.o
m68k-unknown-linux-gnu-gcc -fPIC -Wno-unused-result -Wsign-compare -DNDEBUG -pipe -O2 -fwrapv -std=c99 -Wextra -Wno-unused-result -Wno-unused-parameter -Wno-missing-field-initializers -Wstrict-prototypes -Werror=implicit-function-declaration -fvisibility=hidden -I./Include/internal -DCONFIG_32=1 -DANSI=1 -I/var/tmp/portage/dev-lang/python-3.10.2-r1/work/Python-3.10.2/Modules/_decimal/libmpdec -I./Include -I. -I/usr/include/ncursesw -I/var/tmp/portage/dev-lang/python-3.10.2-r1/work/Python-3.10.2/Include -I/var/tmp/portage/dev-lang/python-3.10.2-r1/work/Python-3.10.2 -c /var/tmp/portage/dev-lang/python-3.10.2-r1/work/Python-3.10.2/Modules/_decimal/libmpdec/mpdecimal.c -o build/temp.linux-m68k-3.10/var/tmp/portage/dev-lang/python-3.10.2-r1/work/Python-3.10.2/Modules/_decimal/libmpdec/mpdecimal.o
m68k-unknown-linux-gnu-gcc -fPIC -Wno-unused-result -Wsign-compare -DNDEBUG -pipe -O2 -fwrapv -std=c99 -Wextra -Wno-unused-result -Wno-unused-parameter -Wno-missing-field-initializers -Wstrict-prototypes -Werror=implicit-function-declaration -fvisibility=hidden -I./Include/internal -DCONFIG_32=1 -DANSI=1 -I/var/tmp/portage/dev-lang/python-3.10.2-r1/work/Python-3.10.2/Modules/_decimal/libmpdec -I./Include -I. -I/usr/include/ncursesw -I/var/tmp/portage/dev-lang/python-3.10.2-r1/work/Python-3.10.2/Include -I/var/tmp/portage/dev-lang/python-3.10.2-r1/work/Python-3.10.2 -c /var/tmp/portage/dev-lang/python-3.10.2-r1/work/Python-3.10.2/Modules/_decimal/libmpdec/numbertheory.c -o build/temp.linux-m68k-3.10/var/tmp/portage/dev-lang/python-3.10.2-r1/work/Python-3.10.2/Modules/_decimal/libmpdec/numbertheory.o
m68k-unknown-linux-gnu-gcc -fPIC -Wno-unused-result -Wsign-compare -DNDEBUG -pipe -O2 -fwrapv -std=c99 -Wextra -Wno-unused-result -Wno-unused-parameter -Wno-missing-field-initializers -Wstrict-prototypes -Werror=implicit-function-declaration -fvisibility=hidden -I./Include/internal -DCONFIG_32=1 -DANSI=1 -I/var/tmp/portage/dev-lang/python-3.10.2-r1/work/Python-3.10.2/Modules/_decimal/libmpdec -I./Include -I. -I/usr/include/ncursesw -I/var/tmp/portage/dev-lang/python-3.10.2-r1/work/Python-3.10.2/Include -I/var/tmp/portage/dev-lang/python-3.10.2-r1/work/Python-3.10.2 -c /var/tmp/portage/dev-lang/python-3.10.2-r1/work/Python-3.10.2/Modules/_decimal/libmpdec/sixstep.c -o build/temp.linux-m68k-3.10/var/tmp/portage/dev-lang/python-3.10.2-r1/work/Python-3.10.2/Modules/_decimal/libmpdec/sixstep.o
m68k-unknown-linux-gnu-gcc -fPIC -Wno-unused-result -Wsign-compare -DNDEBUG -pipe -O2 -fwrapv -std=c99 -Wextra -Wno-unused-result -Wno-unused-parameter -Wno-missing-field-initializers -Wstrict-prototypes -Werror=implicit-function-declaration -fvisibility=hidden -I./Include/internal -DCONFIG_32=1 -DANSI=1 -I/var/tmp/portage/dev-lang/python-3.10.2-r1/work/Python-3.10.2/Modules/_decimal/libmpdec -I./Include -I. -I/usr/include/ncursesw -I/var/tmp/portage/dev-lang/python-3.10.2-r1/work/Python-3.10.2/Include -I/var/tmp/portage/dev-lang/python-3.10.2-r1/work/Python-3.10.2 -c /var/tmp/portage/dev-lang/python-3.10.2-r1/work/Python-3.10.2/Modules/_decimal/libmpdec/transpose.c -o build/temp.linux-m68k-3.10/var/tmp/portage/dev-lang/python-3.10.2-r1/work/Python-3.10.2/Modules/_decimal/libmpdec/transpose.o
m68k-unknown-linux-gnu-gcc -shared -Wl,-O1 -Wl,--as-needed -Wno-unused-result -Wsign-compare -DNDEBUG build/temp.linux-m68k-3.10/var/tmp/portage/dev-lang/python-3.10.2-r1/work/Python-3.10.2/Modules/_decimal/_decimal.o build/temp.linux-m68k-3.10/var/tmp/portage/dev-lang/python-3.10.2-r1/work/Python-3.10.2/Modules/_decimal/libmpdec/basearith.o build/temp.linux-m68k-3.10/var/tmp/portage/dev-lang/python-3.10.2-r1/work/Python-3.10.2/Modules/_decimal/libmpdec/constants.o build/temp.linux-m68k-3.10/var/tmp/portage/dev-lang/python-3.10.2-r1/work/Python-3.10.2/Modules/_decimal/libmpdec/context.o build/temp.linux-m68k-3.10/var/tmp/portage/dev-lang/python-3.10.2-r1/work/Python-3.10.2/Modules/_decimal/libmpdec/convolute.o build/temp.linux-m68k-3.10/var/tmp/portage/dev-lang/python-3.10.2-r1/work/Python-3.10.2/Modules/_decimal/libmpdec/crt.o build/temp.linux-m68k-3.10/var/tmp/portage/dev-lang/python-3.10.2-r1/work/Python-3.10.2/Modules/_decimal/libmpdec/difradix2.o build/temp.linux-m68k-3.10/var/t
mp/portage/dev-lang/python-3.10.2-r1/work/Python-3.10.2/Modules/_decimal/libmpdec/fnt.o build/temp.linux-m68k-3.10/var/tmp/portage/dev-lang/python-3.10.2-r1/work/Python-3.10.2/Modules/_decimal/libmpdec/fourstep.o build/temp.linux-m68k-3.10/var/tmp/portage/dev-lang/python-3.10.2-r1/work/Python-3.10.2/Modules/_decimal/libmpdec/io.o build/temp.linux-m68k-3.10/var/tmp/portage/dev-lang/python-3.10.2-r1/work/Python-3.10.2/Modules/_decimal/libmpdec/mpalloc.o build/temp.linux-m68k-3.10/var/tmp/portage/dev-lang/python-3.10.2-r1/work/Python-3.10.2/Modules/_decimal/libmpdec/mpdecimal.o build/temp.linux-m68k-3.10/var/tmp/portage/dev-lang/python-3.10.2-r1/work/Python-3.10.2/Modules/_decimal/libmpdec/numbertheory.o build/temp.linux-m68k-3.10/var/tmp/portage/dev-lang/python-3.10.2-r1/work/Python-3.10.2/Modules/_decimal/libmpdec/sixstep.o build/temp.linux-m68k-3.10/var/tmp/portage/dev-lang/python-3.10.2-r1/work/Python-3.10.2/Modules/_decimal/libmpdec/transpose.o -L. -L/usr/local/lib -lm -o build/li
b.linux-m68k-3.10/_decimal.cpython-310-m68k-linux-gnu.so
The futex facility returned an unexpected error code.
The futex facility returned an unexpected error code.
The futex facility returned an unexpected error code.
The futex facility returned an unexpected error code.
make: *** [Makefile:636: sharedmods] Aborted (core dumped)
* ERROR: dev-lang/python-3.10.2-r1::gentoo failed (compile phase):
* emake failed
*
* If you need support, post the output of `emerge --info '=dev-lang/python-3.10.2-r1::gentoo'`,
* the complete build log and the output of `emerge -pqv '=dev-lang/python-3.10.2-r1::gentoo'`.
* The complete build log is located at '/var/tmp/portage/dev-lang/python-3.10.2-r1/temp/build.log'.
* The ebuild environment file is located at '/var/tmp/portage/dev-lang/python-3.10.2-r1/temp/environment'.
* Working directory: '/var/tmp/portage/dev-lang/python-3.10.2-r1/work/Python-3.10.2'
* S: '/var/tmp/portage/dev-lang/python-3.10.2-r1/work/Python-3.10.2'
* Messages for package sys-libs/glibc-2.34-r9:
* After upgrading glibc, please restart all running processes.
* Be sure to include init (telinit u) or systemd (systemctl daemon-reexec).
* Alternatively, reboot your system.
* Messages for package sys-apps/portage-3.0.30-r1:
* Unable to find kernel sources at /usr/src/linux
* Unable to calculate Linux Kernel version for build, attempting to use running version
* Messages for package acct-group/sgx-0:
* Adding group 'sgx' to your system ...
* - Groupid: 405
* Messages for package sys-apps/baselayout-2.8:
* After updating /etc/profile, please run
* env-update && . /etc/profile
* Please run env-update then log out and back in to
* update your path.
* Messages for package sys-apps/sysvinit-3.01:
* The last/lastb/mesg/mountpoint/sulogin/utmpdump/wall tools have been moved to
* sys-apps/util-linux. The pidof tool has been moved to sys-process/procps.
* Messages for package net-firewall/iptables-1.8.7:
* Unsetting ebtables symlinks before removal
* Unsetting arptables symlinks before removal
* Messages for package dev-lang/perl-5.34.0-r5:
* Removing dead symlink //usr/share/man/man1/ptar.1.bz2
* Removing dead symlink //usr/share/man/man1/ptardiff.1.bz2
* Removing dead symlink //usr/share/man/man1/ptargrep.1.bz2
* Removing dead symlink //usr/share/man/man1/cpan.1.bz2
* Removing dead symlink //usr/share/man/man1/shasum.1.bz2
* Removing dead symlink //usr/share/man/man1/instmodsh.1.bz2
* Removing dead symlink //usr/share/man/man1/xsubpp.1.bz2
* Removing dead symlink //usr/share/man/man1/zipdetails.1.bz2
* Removing dead symlink //usr/share/man/man1/json_pp.1.bz2
* Removing dead symlink //usr/share/man/man1/corelist.1.bz2
* Removing dead symlink //usr/share/man/man1/podchecker.1.bz2
* Removing dead symlink //usr/share/man/man1/perldoc.1.bz2
* Removing dead symlink //usr/share/man/man1/pod2usage.1.bz2
* Removing dead symlink //usr/share/man/man1/prove.1.bz2
* Removing dead symlink //usr/share/man/man1/pod2man.1.bz2
* Removing dead symlink //usr/share/man/man1/pod2text.1.bz2
* Removing dead symlink //usr/share/man/man1/perlpodstyle.1.bz2
* Messages for package dev-lang/perl-5.34.0-r8:
* Unable to establish //usr/share/man/man1/ptar.1* symlink
* Unable to establish //usr/share/man/man1/ptardiff.1* symlink
* Unable to establish //usr/share/man/man1/ptargrep.1* symlink
* Unable to establish //usr/share/man/man1/cpan.1* symlink
* Unable to establish //usr/share/man/man1/shasum.1* symlink
* Unable to establish //usr/share/man/man1/instmodsh.1* symlink
* Unable to establish //usr/share/man/man1/xsubpp.1* symlink
* Unable to establish //usr/share/man/man1/zipdetails.1* symlink
* Unable to establish //usr/share/man/man1/json_pp.1* symlink
* Unable to establish //usr/share/man/man1/corelist.1* symlink
* Unable to establish //usr/share/man/man1/podchecker.1* symlink
* Unable to establish //usr/share/man/man1/perldoc.1* symlink
* Unable to establish //usr/share/man/man1/pod2usage.1* symlink
* Unable to establish //usr/share/man/man1/prove.1* symlink
* Unable to establish //usr/share/man/man1/pod2man.1* symlink
* Unable to establish //usr/share/man/man1/pod2text.1* symlink
* Unable to establish //usr/share/man/man1/perlpodstyle.1* symlink
* Messages for package perl-core/CPAN-2.290.0-r1:
* Unable to establish //usr/share/man/man1/cpan-mirrors.1* symlink
* Unable to establish //usr/share/man/man1/cpan.1* symlink
* Messages for package sys-apps/coreutils-9.0-r2:
* Make sure you run 'hash -r' in your active shells.
* You should also re-source your shell settings for LS_COLORS
* changes, such as: source /etc/profile
* Messages for package sys-apps/util-linux-2.37.4:
* The mesg/wall/write tools have been disabled due to USE=-tty-helpers.
* Messages for package dev-lang/python-3.9.10-r1:
* User patches applied.
* Messages for package sys-libs/glibc-2.34-r9:
* Generating all locales; edit /etc/locale.gen to save time/space
* After upgrading glibc, please restart all running processes.
* Be sure to include init (telinit u) or systemd (systemctl daemon-reexec).
* Alternatively, reboot your system.
* Messages for package dev-lang/python-3.10.2-r1:
* User patches applied.
* ERROR: dev-lang/python-3.10.2-r1::gentoo failed (compile phase):
* emake failed
*
* If you need support, post the output of `emerge --info '=dev-lang/python-3.10.2-r1::gentoo'`,
* the complete build log and the output of `emerge -pqv '=dev-lang/python-3.10.2-r1::gentoo'`.
* The complete build log is located at '/var/tmp/portage/dev-lang/python-3.10.2-r1/temp/build.log'.
* The ebuild environment file is located at '/var/tmp/portage/dev-lang/python-3.10.2-r1/temp/environment'.
* Working directory: '/var/tmp/portage/dev-lang/python-3.10.2-r1/work/Python-3.10.2'
* S: '/var/tmp/portage/dev-lang/python-3.10.2-r1/work/Python-3.10.2'
02 Mar 2022 23:04:38 UTC: ERROR : CatalystError: cmd(['/usr/share/catalyst/targets/stage1/stage1-controller.sh', 'run']) exited 1
ERROR:catalyst:CatalystError: cmd(['/usr/share/catalyst/targets/stage1/stage1-controller.sh', 'run']) exited 1
02 Mar 2022 23:04:38 UTC: ERROR : CatalystError: Stage build aborting due to error.
ERROR:catalyst:CatalystError: Stage build aborting due to error.
02 Mar 2022 23:04:38 UTC: ERROR : Exception running action sequence run_local
Traceback (most recent call last):
File "/usr/lib/python3.9/site-packages/catalyst/base/stagebase.py", line 1409, in run_local
cmd([self.settings['controller_file'], 'run'],
File "/usr/lib/python3.9/site-packages/catalyst/support.py", line 53, in cmd
raise CatalystError('cmd(%r) exited %s' % (args, ret),
catalyst.support.CatalystError: cmd(['/usr/share/catalyst/targets/stage1/stage1-controller.sh', 'run']) exited 1
During handling of the above exception, another exception occurred:
Traceback (most recent call last):
File "/usr/lib/python3.9/site-packages/catalyst/base/stagebase.py", line 1515, in run
getattr(self, x)()
File "/usr/lib/python3.9/site-packages/catalyst/base/stagebase.py", line 1418, in run_local
raise CatalystError("Stage build aborting due to error.",
catalyst.support.CatalystError: Stage build aborting due to error.
ERROR:catalyst:Exception running action sequence run_local
Traceback (most recent call last):
File "/usr/lib/python3.9/site-packages/catalyst/base/stagebase.py", line 1409, in run_local
cmd([self.settings['controller_file'], 'run'],
File "/usr/lib/python3.9/site-packages/catalyst/support.py", line 53, in cmd
raise CatalystError('cmd(%r) exited %s' % (args, ret),
catalyst.support.CatalystError: cmd(['/usr/share/catalyst/targets/stage1/stage1-controller.sh', 'run']) exited 1
During handling of the above exception, another exception occurred:
Traceback (most recent call last):
File "/usr/lib/python3.9/site-packages/catalyst/base/stagebase.py", line 1515, in run
getattr(self, x)()
File "/usr/lib/python3.9/site-packages/catalyst/base/stagebase.py", line 1418, in run_local
raise CatalystError("Stage build aborting due to error.",
catalyst.support.CatalystError: Stage build aborting due to error.
02 Mar 2022 23:04:38 UTC: NOTICE : Cleaning up... Running unbind()
NOTICE:catalyst:Cleaning up... Running unbind()
02 Mar 2022 23:04:38 UTC: NOTICE : /var/tmp/catalyst/tmp/default/stage1-m68k-openrc-20220302T170530Z/tmp/kerncache is not a mount point. Skipping
NOTICE:catalyst:/var/tmp/catalyst/tmp/default/stage1-m68k-openrc-20220302T170530Z/tmp/kerncache is not a mount point. Skipping
02 Mar 2022 23:04:38 UTC: NOTICE : /var/tmp/catalyst/tmp/default/stage1-m68k-openrc-20220302T170530Z/var/cache/binpkgs is not a mount point. Skipping
NOTICE:catalyst:/var/tmp/catalyst/tmp/default/stage1-m68k-openrc-20220302T170530Z/var/cache/binpkgs is not a mount point. Skipping
02 Mar 2022 23:04:38 UTC: NOTICE : /var/tmp/catalyst/tmp/default/stage1-m68k-openrc-20220302T170530Z/tmp/stage1root/proc is not a mount point. Skipping
NOTICE:catalyst:/var/tmp/catalyst/tmp/default/stage1-m68k-openrc-20220302T170530Z/tmp/stage1root/proc is not a mount point. Skipping
02 Mar 2022 23:04:38 UTC: NOTICE : /var/tmp/catalyst/tmp/default/stage1-m68k-openrc-20220302T170530Z/run is not a mount point. Skipping
NOTICE:catalyst:/var/tmp/catalyst/tmp/default/stage1-m68k-openrc-20220302T170530Z/run is not a mount point. Skipping
02 Mar 2022 23:04:38 UTC: NOTICE : /var/tmp/catalyst/tmp/default/stage1-m68k-openrc-20220302T170530Z/dev/shm does not exist. Skipping
NOTICE:catalyst:/var/tmp/catalyst/tmp/default/stage1-m68k-openrc-20220302T170530Z/dev/shm does not exist. Skipping
02 Mar 2022 23:04:38 UTC: NOTICE : /var/tmp/catalyst/tmp/default/stage1-m68k-openrc-20220302T170530Z/dev/pts does not exist. Skipping
NOTICE:catalyst:/var/tmp/catalyst/tmp/default/stage1-m68k-openrc-20220302T170530Z/dev/pts does not exist. Skipping
02 Mar 2022 23:04:38 UTC: NOTICE : /var/tmp/catalyst/tmp/default/stage1-m68k-openrc-20220302T170530Z/var/tmp/portage is not a mount point. Skipping
NOTICE:catalyst:/var/tmp/catalyst/tmp/default/stage1-m68k-openrc-20220302T170530Z/var/tmp/portage is not a mount point. Skipping
02 Mar 2022 23:04:38 UTC: NOTICE : /var/tmp/catalyst/tmp/default/stage1-m68k-openrc-20220302T170530Z/var/cache/distfiles is not a mount point. Skipping
NOTICE:catalyst:/var/tmp/catalyst/tmp/default/stage1-m68k-openrc-20220302T170530Z/var/cache/distfiles is not a mount point. Skipping
02 Mar 2022 23:04:38 UTC: NOTICE : /var/tmp/catalyst/tmp/default/stage1-m68k-openrc-20220302T170530Z/var/db/repos/gentoo is not a mount point. Skipping
NOTICE:catalyst:/var/tmp/catalyst/tmp/default/stage1-m68k-openrc-20220302T170530Z/var/db/repos/gentoo is not a mount point. Skipping
02 Mar 2022 23:04:38 UTC: NOTICE : /var/tmp/catalyst/tmp/default/stage1-m68k-openrc-20220302T170530Z/dev is not a mount point. Skipping
NOTICE:catalyst:/var/tmp/catalyst/tmp/default/stage1-m68k-openrc-20220302T170530Z/dev is not a mount point. Skipping
02 Mar 2022 23:04:38 UTC: NOTICE : /var/tmp/catalyst/tmp/default/stage1-m68k-openrc-20220302T170530Z/proc is not a mount point. Skipping
NOTICE:catalyst:/var/tmp/catalyst/tmp/default/stage1-m68k-openrc-20220302T170530Z/proc is not a mount point. Skipping
Command exited with non-zero status 2
69729.38user 1853.96system 5:59:01elapsed 332%CPU (0avgtext+0avgdata 614924maxresident)k
404058inputs+6567600outputs (7382major+766660532minor)pagefaults 0swaps
Full build log at /tmp/catalyst-auto.20220302T170530Z.aoTmQF/log/stage1-openrc.log
next reply other threads:[~2022-03-02 23:04 UTC|newest]
Thread overview: 51+ messages / expand[flat|nested] mbox.gz Atom feed top
2022-03-02 23:04 catalyst [this message]
-- strict thread matches above, loose matches on Subject: below --
2024-05-30 11:44 [gentoo-releng-autobuilds] [m68k-qemu-auto] Catalyst fatal build error - stage1-openrc.spec catalyst
2024-05-23 3:43 catalyst
2023-11-23 0:25 catalyst
2022-12-14 17:36 catalyst
2022-08-11 5:35 catalyst
2022-08-04 6:51 catalyst
2022-07-21 6:56 catalyst
2022-07-06 21:48 catalyst
2022-06-29 19:37 catalyst
2022-06-22 18:01 catalyst
2022-06-15 17:30 catalyst
2022-06-08 18:55 catalyst
2022-05-28 14:55 catalyst
2022-05-28 14:52 catalyst
2022-05-25 17:09 catalyst
2022-05-18 23:36 catalyst
2022-05-11 22:59 catalyst
2022-05-04 23:47 catalyst
2022-04-28 0:15 catalyst
2022-04-20 23:32 catalyst
2022-04-13 23:17 catalyst
2022-04-06 23:25 catalyst
2022-04-01 1:40 catalyst
2022-03-30 23:27 catalyst
2022-03-23 23:23 catalyst
2022-03-16 23:51 catalyst
2022-03-09 23:01 catalyst
2022-02-23 23:10 catalyst
2022-02-16 23:51 catalyst
2022-02-09 23:35 catalyst
2022-02-06 6:48 catalyst
2022-02-02 23:06 catalyst
2022-01-26 22:59 catalyst
2022-01-21 17:57 catalyst
2022-01-19 22:32 catalyst
2022-01-12 22:24 catalyst
2022-01-06 2:33 catalyst
2021-12-30 1:27 catalyst
2021-12-23 0:45 catalyst
2021-12-15 23:56 catalyst
2021-12-08 23:51 catalyst
2021-12-03 0:03 catalyst
2021-12-02 15:07 catalyst
2021-12-01 18:32 catalyst
2021-11-24 22:50 catalyst
2021-11-24 17:05 catalyst
2021-11-17 18:23 catalyst
2021-08-22 22:33 catalyst
2021-08-22 13:06 catalyst
2021-08-22 10:52 catalyst
Reply instructions:
You may reply publicly to this message via plain-text email
using any one of the following methods:
* Save the following mbox file, import it into your mail client,
and reply-to-all from there: mbox
Avoid top-posting and favor interleaved quoting:
https://en.wikipedia.org/wiki/Posting_style#Interleaved_style
* Reply using the --to, --cc, and --in-reply-to
switches of git-send-email(1):
git send-email \
--in-reply-to=20220302230438.E40BF2680EB@demeter.amd64.dev.gentoo.org \
--to=catalyst@demeter.amd64.dev.gentoo.org \
--cc=gentoo-releng-autobuilds@lists.gentoo.org \
--cc=releng@gentoo.org \
/path/to/YOUR_REPLY
https://kernel.org/pub/software/scm/git/docs/git-send-email.html
* If your mail client supports setting the In-Reply-To header
via mailto: links, try the mailto: link
Be sure your reply has a Subject: header at the top and a blank line
before the message body.
This is a public inbox, see mirroring instructions
for how to clone and mirror all data and code used for this inbox