11 May 2020 11:32:16 UTC: NOTICE  : --- Running action sequence: setup_confdir
11 May 2020 11:32:16 UTC: NOTICE  : --- Running action sequence: portage_overlay
11 May 2020 11:32:16 UTC: NOTICE  : --- Running action sequence: base_dirs
11 May 2020 11:32:16 UTC: NOTICE  : --- Running action sequence: bind
11 May 2020 11:32:16 UTC: NOTICE  : --- Running action sequence: chroot_setup
11 May 2020 11:32:16 UTC: NOTICE  : Setting up chroot...
NOTICE:catalyst:Setting up chroot...
11 May 2020 11:32:16 UTC: WARNING : Overriding certain env variables may cause catastrophic failure.
WARNING:catalyst:Overriding certain env variables may cause catastrophic failure.
11 May 2020 11:32:16 UTC: WARNING : If your build fails look here first as the possible problem.
WARNING:catalyst:If your build fails look here first as the possible problem.
11 May 2020 11:32:16 UTC: WARNING : Catalyst assumes you know what you are doing when setting these variables.
WARNING:catalyst:Catalyst assumes you know what you are doing when setting these variables.
11 May 2020 11:32:16 UTC: WARNING : Catalyst Maintainers use VERY minimal envscripts, if used at all.
WARNING:catalyst:Catalyst Maintainers use VERY minimal envscripts, if used at all.
11 May 2020 11:32:16 UTC: WARNING : You have been warned.
WARNING:catalyst:You have been warned.
11 May 2020 11:32:16 UTC: NOTICE  : Writing the stage make.conf to: /release/buildroot/amd64-dev/tmp/default/stage1-x32-20200511T112607Z/etc/portage/make.conf
NOTICE:catalyst:Writing the stage make.conf to: /release/buildroot/amd64-dev/tmp/default/stage1-x32-20200511T112607Z/etc/portage/make.conf
11 May 2020 11:32:16 UTC: NOTICE  : STICKY-CONFIG is enabled
NOTICE:catalyst:STICKY-CONFIG is enabled
11 May 2020 11:32:16 UTC: NOTICE  : --- Running action sequence: setup_environment
NOTICE:catalyst:--- Running action sequence: setup_environment
11 May 2020 11:32:16 UTC: NOTICE  : --- Running action sequence: run_local
NOTICE:catalyst:--- Running action sequence: run_local
copying make.conf to /release/buildroot/amd64-dev/tmp/default/stage1-x32-20200511T112607Z/tmp/stage1root/etc/portage
Copying stage1-chroot.sh to /tmp
copying stage1-chroot.sh to /release/buildroot/amd64-dev/tmp/default/stage1-x32-20200511T112607Z/tmp
copying chroot-functions.sh to /release/buildroot/amd64-dev/tmp/default/stage1-x32-20200511T112607Z/tmp
Ensure the file has the executable bit set
Running stage1-chroot.sh in chroot:
    chroot /release/buildroot/amd64-dev/tmp/default/stage1-x32-20200511T112607Z /tmp/stage1-chroot.sh
>>> Regenerating /etc/ld.so.cache...
Adding USE="${USE} build" to make.conf for portage build
emerge --quiet --oneshot --update --newuse sys-apps/portage

Performing Global Updates
(Could take a couple of minutes if you have a lot of binary packages.)



!!! The following installed packages are masked:
- sys-libs/glibc-2.29-r7::gentoo (masked by: package.mask)
/var/db/repos/gentoo/profiles/package.mask:
# Michał Górny <mgorny@gentoo.org>, Andreas K. Hüttel <dilfridge@gentoo.org>,
# Matthias Maier <tamiko@gentoo.org> (2017-05-21 and later updates)
# These old versions of toolchain packages (binutils, gcc, glibc) are no
# longer officially supported and are not suitable for general use. Using
# these packages can result in build failures (and possible breakage) for
# many packages, and may leave your system vulnerable to known security
# exploits.
# If you still use one of these old toolchain packages, please upgrade (and
# switch the compiler / the binutils) ASAP. If you need them for a specific
# (isolated) use case, feel free to unmask them on your system.

For more information, see the MASKED PACKAGES section in the emerge
man page or refer to the Gentoo Handbook.

>>> Verifying ebuild manifests
>>> Running pre-merge checks for sys-apps/portage-2.3.99-r2
 * Determining the location of the kernel source code
 * Unable to find kernel sources at /usr/src/linux
 * Please make sure that /usr/src/linux points at your running kernel, 
 * (or the kernel you wish to build against).
 * Alternatively, set the KERNEL_DIR environment variable to the kernel sources location
 * Unable to calculate Linux Kernel version for build, attempting to use running version
 * Checking for suitable kernel configuration options...
 [ ok ]
>>> Emerging (1 of 1) sys-apps/portage-2.3.99-r2::gentoo
>>> Installing (1 of 1) sys-apps/portage-2.3.99-r2::gentoo
 * Messages for package sys-apps/portage-2.3.99-r2:
 * Unable to find kernel sources at /usr/src/linux
 * Unable to calculate Linux Kernel version for build, attempting to use running version
 * Messages for package sys-apps/portage-2.3.99-r2:
 * Unable to find kernel sources at /usr/src/linux
 * Unable to calculate Linux Kernel version for build, attempting to use running version




Updating seed stage...
emerge --quiet --buildpkg=n --update --deep @world
[ebuild     U ] sys-libs/ncurses-6.2-r1 [6.1_p20190609]
[ebuild     U ] sys-libs/timezone-data-2020a [2019c]
[ebuild     U ] sys-libs/readline-8.0_p4 [7.0_p5-r1]
[ebuild     U ] app-shells/bash-5.0_p17 [4.4_p23-r1]
[ebuild     U ] dev-libs/libpcre-8.43 [8.42]
[ebuild     U ] dev-libs/openssl-1.1.1g [1.1.1f]
[ebuild     U ] sys-apps/debianutils-4.9.1 [4.8.3]
[ebuild  N    ] sys-kernel/installkernel-gentoo-2 
[ebuild     U ] virtual/libcrypt-1-r1 [1]
[ebuild     U ] sys-apps/util-linux-2.35.1-r2 [2.33.2]
[ebuild  NS   ] dev-lang/python-3.8.2-r2 [2.7.17-r2, 3.6.10-r1, 3.7.7-r1]
[ebuild     U ] sys-libs/glibc-2.30-r8 [2.29-r7]
[ebuild     U ] dev-lang/python-3.7.7-r2 [3.7.7-r1]
[ebuild     U ] dev-lang/python-3.6.10-r2 [3.6.10-r1]
[ebuild     U ] dev-lang/python-2.7.18 [2.7.17-r2]
[ebuild     U ] dev-python/setuptools-44.1.0 [44.0.0]
[ebuild   R   ] dev-python/certifi-2019.11.28 

!!! Multiple package instances within a single package slot have been pulled
!!! into the dependency graph, resulting in a slot conflict:

sys-libs/readline:0

  (sys-libs/readline-7.0_p5-r1:0/7::gentoo, installed) USE="(split-usr) unicode -static-libs -utils" ABI_X86="64 (x32) -32" pulled in by
    sys-libs/readline:0/7= required by (app-crypt/gnupg-2.2.19:0/0::gentoo, installed) USE="bzip2 nls readline smartcard ssl -doc -ldap (-selinux) -tofu -tools -usb -user-socket -wks-server" ABI_X86="(x32)"
                     ^^^^^                                                                                                                                                                                     
    (and 4 more with the same problem)

  (sys-libs/readline-8.0_p4:0/8::gentoo, ebuild scheduled for merge) USE="(split-usr) unicode -static-libs -utils" ABI_X86="64 (x32) -32" pulled in by
    >=sys-libs/readline-8.0:0= required by (app-shells/bash-5.0_p17:0/0::gentoo, ebuild scheduled for merge) USE="net nls (readline) -afs -bashlogger -examples -mem-scramble -plugins" ABI_X86="(x32)"
    ^^                  ^^^^^^                                                                                                                                                                          

NOTE: Use the '--verbose-conflicts' option to display parents omitted above


The following USE changes are necessary to proceed:
 (see "package.use" in the portage(5) man page for more details)
# required by dev-python/certifi-2019.11.28::gentoo
>=dev-python/setuptools-44.1.0 python_targets_python3_6
# required by dev-python/setuptools-44.1.0::gentoo
# required by dev-util/meson-0.52.1::gentoo
# required by net-misc/iputils-20190709-r1::gentoo
# required by @system
# required by @world (argument)
>=dev-python/certifi-2019.11.28 python_targets_python3_6

Use --autounmask-write to write changes to config files (honoring
CONFIG_PROTECT). Carefully examine the list of proposed changes,
paying special attention to mask or keyword changes that may expose
experimental or unstable packages.

 * In order to avoid wasting time, backtracking has terminated early
 * due to the above autounmask change(s). The --autounmask-backtrack=y
 * option can be used to force further backtracking, but there is no
 * guarantee that it will produce a solution.
11 May 2020 11:33:07 UTC: ERROR   : CatalystError: cmd(['/usr/share/catalyst/targets/stage1/stage1-controller.sh', 'run']) exited 1
ERROR:catalyst:CatalystError: cmd(['/usr/share/catalyst/targets/stage1/stage1-controller.sh', 'run']) exited 1
11 May 2020 11:33:07 UTC: NOTICE  : /release/buildroot/amd64-dev/tmp/default/stage1-x32-20200511T112607Z/var/tmp/portage is not a mount point. Skipping
NOTICE:catalyst:/release/buildroot/amd64-dev/tmp/default/stage1-x32-20200511T112607Z/var/tmp/portage is not a mount point. Skipping
11 May 2020 11:33:07 UTC: ERROR   : CatalystError: Stage build aborting due to error.
ERROR:catalyst:CatalystError: Stage build aborting due to error.
11 May 2020 11:33:07 UTC: ERROR   : Exception running action sequence run_local
Traceback (most recent call last):
  File "/usr/lib64/python3.6/site-packages/catalyst/base/stagebase.py", line 1366, in run_local
    env=self.env)
  File "/usr/lib64/python3.6/site-packages/catalyst/support.py", line 54, in cmd
    print_traceback=False)
catalyst.support.CatalystError: cmd(['/usr/share/catalyst/targets/stage1/stage1-controller.sh', 'run']) exited 1

During handling of the above exception, another exception occurred:

Traceback (most recent call last):
  File "/usr/lib64/python3.6/site-packages/catalyst/base/stagebase.py", line 1471, in run
    getattr(self, x)()
  File "/usr/lib64/python3.6/site-packages/catalyst/base/stagebase.py", line 1375, in run_local
    print_traceback=False)
catalyst.support.CatalystError: Stage build aborting due to error.
ERROR:catalyst:Exception running action sequence run_local
Traceback (most recent call last):
  File "/usr/lib64/python3.6/site-packages/catalyst/base/stagebase.py", line 1366, in run_local
    env=self.env)
  File "/usr/lib64/python3.6/site-packages/catalyst/support.py", line 54, in cmd
    print_traceback=False)
catalyst.support.CatalystError: cmd(['/usr/share/catalyst/targets/stage1/stage1-controller.sh', 'run']) exited 1

During handling of the above exception, another exception occurred:

Traceback (most recent call last):
  File "/usr/lib64/python3.6/site-packages/catalyst/base/stagebase.py", line 1471, in run
    getattr(self, x)()
  File "/usr/lib64/python3.6/site-packages/catalyst/base/stagebase.py", line 1375, in run_local
    print_traceback=False)
catalyst.support.CatalystError: Stage build aborting due to error.
11 May 2020 11:33:07 UTC: NOTICE  : Cleaning up... Running unbind()
NOTICE:catalyst:Cleaning up... Running unbind()
11 May 2020 11:33:07 UTC: NOTICE  : /release/buildroot/amd64-dev/tmp/default/stage1-x32-20200511T112607Z/var/cache/binpkgs is not a mount point. Skipping
NOTICE:catalyst:/release/buildroot/amd64-dev/tmp/default/stage1-x32-20200511T112607Z/var/cache/binpkgs is not a mount point. Skipping
11 May 2020 11:33:07 UTC: NOTICE  : /release/buildroot/amd64-dev/tmp/default/stage1-x32-20200511T112607Z/tmp/stage1root/proc is not a mount point. Skipping
NOTICE:catalyst:/release/buildroot/amd64-dev/tmp/default/stage1-x32-20200511T112607Z/tmp/stage1root/proc is not a mount point. Skipping
11 May 2020 11:33:07 UTC: NOTICE  : /release/buildroot/amd64-dev/tmp/default/stage1-x32-20200511T112607Z/run is not a mount point. Skipping
NOTICE:catalyst:/release/buildroot/amd64-dev/tmp/default/stage1-x32-20200511T112607Z/run is not a mount point. Skipping
11 May 2020 11:33:07 UTC: NOTICE  : /release/buildroot/amd64-dev/tmp/default/stage1-x32-20200511T112607Z/dev/shm does not exist. Skipping
NOTICE:catalyst:/release/buildroot/amd64-dev/tmp/default/stage1-x32-20200511T112607Z/dev/shm does not exist. Skipping
11 May 2020 11:33:07 UTC: NOTICE  : /release/buildroot/amd64-dev/tmp/default/stage1-x32-20200511T112607Z/dev/pts does not exist. Skipping
NOTICE:catalyst:/release/buildroot/amd64-dev/tmp/default/stage1-x32-20200511T112607Z/dev/pts does not exist. Skipping
11 May 2020 11:33:07 UTC: NOTICE  : /release/buildroot/amd64-dev/tmp/default/stage1-x32-20200511T112607Z/var/tmp/portage is not a mount point. Skipping
NOTICE:catalyst:/release/buildroot/amd64-dev/tmp/default/stage1-x32-20200511T112607Z/var/tmp/portage is not a mount point. Skipping
11 May 2020 11:33:07 UTC: NOTICE  : /release/buildroot/amd64-dev/tmp/default/stage1-x32-20200511T112607Z/var/cache/distfiles is not a mount point. Skipping
NOTICE:catalyst:/release/buildroot/amd64-dev/tmp/default/stage1-x32-20200511T112607Z/var/cache/distfiles is not a mount point. Skipping
11 May 2020 11:33:07 UTC: NOTICE  : /release/buildroot/amd64-dev/tmp/default/stage1-x32-20200511T112607Z/var/db/repos/gentoo is not a mount point. Skipping
NOTICE:catalyst:/release/buildroot/amd64-dev/tmp/default/stage1-x32-20200511T112607Z/var/db/repos/gentoo is not a mount point. Skipping
11 May 2020 11:33:07 UTC: NOTICE  : /release/buildroot/amd64-dev/tmp/default/stage1-x32-20200511T112607Z/dev is not a mount point. Skipping
NOTICE:catalyst:/release/buildroot/amd64-dev/tmp/default/stage1-x32-20200511T112607Z/dev is not a mount point. Skipping
11 May 2020 11:33:07 UTC: NOTICE  : /release/buildroot/amd64-dev/tmp/default/stage1-x32-20200511T112607Z/proc is not a mount point. Skipping
NOTICE:catalyst:/release/buildroot/amd64-dev/tmp/default/stage1-x32-20200511T112607Z/proc is not a mount point. Skipping
Command exited with non-zero status 2
65.05user 16.80system 0:59.16elapsed 138%CPU (0avgtext+0avgdata 362432maxresident)k
509176inputs+2851504outputs (0major+1457862minor)pagefaults 0swaps



Full build log at /release/tmp/run/catalyst-auto.20200511T112607Z.HE8TSB/log/stage1-x32.log