* [gentoo-releng-autobuilds] [amd64-auto] Catalyst fatal build error - hardened/stage3.spec
@ 2011-05-12 17:58 catalyst
0 siblings, 0 replies; 24+ messages in thread
From: catalyst @ 2011-05-12 17:58 UTC (permalink / raw
To: releng, gentoo-releng-autobuilds
>>> Installing (113 of 135) sys-devel/automake-1.11.1
>>> Emerging (114 of 135) sys-apps/groff-1.21
>>> Installing (114 of 135) sys-apps/groff-1.21
>>> Emerging (115 of 135) sys-apps/man-1.6f-r4
>>> Failed to emerge sys-apps/man-1.6f-r4, Log file:
>>> '/var/tmp/portage/sys-apps/man-1.6f-r4/temp/build.log'
* Package: sys-apps/man-1.6f-r4
* Repository: gentoo
* Maintainer: base-system@gentoo.org
* USE: amd64 elibc_glibc kernel_linux multilib nls userland_GNU
* FEATURES: ccache sandbox
* Adding group 'man' to your system ...
* - Groupid: 15
/usr/portage/eclass/eutils.eclass: line 860: groupadd: command not found
* ERROR: sys-apps/man-1.6f-r4 failed (setup phase):
* enewgroup failed
*
* Call stack:
* ebuild.sh, line 56: Called pkg_setup
* man-1.6f-r4.ebuild, line 24: Called enewgroup 'man' '15'
* eutils.eclass, line 860: Called die
* The specific snippet of code:
* groupadd -r ${opts} ${egroup} || die "enewgroup failed"
*
* If you need support, post the output of 'emerge --info =sys-apps/man-1.6f-r4',
* the complete build log and the output of 'emerge -pqv =sys-apps/man-1.6f-r4'.
* The complete build log is located at '/var/tmp/portage/sys-apps/man-1.6f-r4/temp/build.log'.
* The ebuild environment file is located at '/var/tmp/portage/sys-apps/man-1.6f-r4/temp/die.env'.
* S: '/var/tmp/portage/sys-apps/man-1.6f-r4/work/man-1.6f'
* Messages for package sys-libs/timezone-data-2011e:
* You do not have TIMEZONE set in /etc/timezone.
* Skipping auto-update of /etc/localtime.
* Messages for package app-portage/portage-utils-0.3.1:
* /etc/portage/postsync.d/q-reinitialize has been installed for convenience
* If you wish for it to be automatically run at the end of every --sync:
* # chmod +x /etc/portage/postsync.d/q-reinitialize
* Normally this should only take a few seconds to run but file systems
* such as ext3 can take a lot longer. To disable, simply do:
* # chmod -x /etc/portage/postsync.d/q-reinitialize
* Messages for package sys-libs/glibc-2.11.3:
* Generating all locales; edit /etc/locale.gen to save time/space
* Messages for package sys-libs/gdbm-1.8.3-r4:
* 32bit systems might have to rebuild all gdbm databases due to
* LFS changes in the gdbm format. You can either delete the db
* and regenerate it from scratch, or use the converter:
* http://bugs.gentoo.org/attachment.cgi?id=215326
*
* See this comment for information on how to use it:
* http://bugs.gentoo.org/299390#c15
*
* You should be able to locate most gdbm db's on your system with:
* find /etc /var -type f -exec file {} + | grep 'GNU dbm 1.x or ndbm database'
*
* You could also try using this helper script:
* http://bugs.gentoo.org/attachment.cgi?id=222581
* Messages for package sys-fs/udev-151-r4:
* Unable to find kernel sources at /usr/src/linux
* Unable to calculate Linux Kernel version for build, attempting to use running version
* CONFIG_SYSFS_DEPRECATED: should not be set. But it is.
* CONFIG_SYSFS_DEPRECATED_V2: should not be set. But it is.
* Please check to make sure these options are set correctly.
* Failure to do so may cause unexpected problems.
*
* udev-151 does not support Linux kernel before version 2.6.25!
* For a reliable udev, use at least kernel 2.6.27
*
* You need to add the udev init script to the runlevel sysinit,
* else your system will not be able to boot
* after updating to >=openrc-0.4.0
* Run this to enable udev for >=openrc-0.4.0:
* rc-update add udev sysinit
*
* Auto-adding 'udev-postmount' service to your default runlevel
*
* If after the udev update removable devices or CD/DVD drives
* stop working, try re-emerging HAL before filling a bug report
*
* persistent-net does assigning fixed names to network devices.
* If you have problems with the persistent-net rules,
* just delete the rules file
* rm /etc/udev/rules.d/70-persistent-net.rules
* and then reboot.
*
* This may however number your devices in a different way than they are now.
*
* If you build an initramfs including udev, then please
* make sure that the /sbin/udevadm binary gets included,
* and your scripts changed to use it,as it replaces the
* old helper apps udevinfo, udevtrigger, ...
*
* mount options for directory /dev are no longer
* set in /etc/udev/udev.conf, but in /etc/fstab
* as for other directories.
*
* This version of udev no longer has devfs-compat enabled
* If you use /dev/md/*, /dev/loop/* or /dev/rd/*,
* then please migrate over to using the device names
* /dev/md*, /dev/loop* and /dev/ram*.
* The devfs-compat rules will be removed on the next udev update.
* For reference see Bug #269359.
*
* This version of udev no longer has use flag old-hd-rules enabled
* So all special rules for /dev/hd* devices are missing
* Please migrate to the new libata if you need these rules.
* They will be completely removed on the next udev update.
*
* For more information on udev on Gentoo, writing udev rules, and
* fixing known issues visit:
* http://www.gentoo.org/doc/en/udev-guide.xml
* Messages for package sys-apps/portage-2.1.9.42:
* If you are an ebuild developer and you plan to commit ebuilds
* with this system then please install dev-python/pycrypto or
* enable the ssl USE flag for >=dev-lang/python-2.6 in order
* to enable RMD160 hash support.
* See bug #198398 for more information.
* Messages for package app-misc/ca-certificates-20090709:
* You should run update-ca-certificates manually after etc-update
* Messages for package dev-vcs/git-1.7.3.4-r1:
* These additional scripts need some dependencies:
* git-quiltimport : dev-util/quilt
* git-instaweb : || ( www-servers/lighttpd www-servers/apache )
* Messages for package sys-apps/coreutils-8.7:
* Make sure you run 'hash -r' in your active shells.
* You should also re-source your shell settings for LS_COLORS
* changes, such as: source /etc/profile
* Messages for package net-misc/wget-1.12-r3:
* The /etc/wget/wgetrc file has been relocated to /etc/wgetrc
* Messages for package sys-fs/e2fsprogs-1.41.12:
* No /etc/mtab file, creating one temporarily
* Messages for package sys-apps/man-1.6f-r4:
* ERROR: sys-apps/man-1.6f-r4 failed (setup phase):
* enewgroup failed
*
* Call stack:
* ebuild.sh, line 56: Called pkg_setup
* man-1.6f-r4.ebuild, line 24: Called enewgroup 'man' '15'
* eutils.eclass, line 860: Called die
* The specific snippet of code:
* groupadd -r ${opts} ${egroup} || die "enewgroup failed"
*
* If you need support, post the output of 'emerge --info =sys-apps/man-1.6f-r4',
* the complete build log and the output of 'emerge -pqv =sys-apps/man-1.6f-r4'.
* The complete build log is located at '/var/tmp/portage/sys-apps/man-1.6f-r4/temp/build.log'.
* The ebuild environment file is located at '/var/tmp/portage/sys-apps/man-1.6f-r4/temp/die.env'.
* S: '/var/tmp/portage/sys-apps/man-1.6f-r4/work/man-1.6f'
* Regenerating GNU info directory index...
* Processed 74 info files.
* IMPORTANT: 2 news items need reading for repository 'gentoo'.
* Use eselect news to read news items.
!!! catalyst: run script failed.
Traceback (most recent call last):
File "modules/generic_stage_target.py", line 1207, in run_local
"run script failed.",env=self.env)
File "/usr/lib64/catalyst/modules/catalyst_support.py", line 542, in cmd
raise CatalystError,myexc
CatalystError
None
!!! catalyst: Stage build aborting due to error.
Traceback (most recent call last):
File "/usr/lib64/catalyst/catalyst", line 209, in build_target
mytarget.run()
File "modules/generic_stage_target.py", line 1263, in run
apply(getattr(self,x))
File "modules/generic_stage_target.py", line 1212, in run_local
raise CatalystError,"Stage build aborting due to error."
CatalystError
!!! catalyst: Error encountered during run of target stage3
Catalyst aborting....
lockfile does not exist '/release/buildroot/amd64-dev/tmp/hardened/stage3-amd64-hardened-20110512/.catalyst_lock'
Full build log at /tmp/catalyst-auto.21578/log/hardened_stage3.log
^ permalink raw reply [flat|nested] 24+ messages in thread
* [gentoo-releng-autobuilds] [amd64-auto] Catalyst fatal build error - hardened/stage3.spec
@ 2011-05-19 17:43 catalyst
0 siblings, 0 replies; 24+ messages in thread
From: catalyst @ 2011-05-19 17:43 UTC (permalink / raw
To: releng, gentoo-releng-autobuilds
>>> Installing (113 of 135) sys-devel/automake-1.11.1
>>> Emerging (114 of 135) sys-apps/groff-1.21
>>> Installing (114 of 135) sys-apps/groff-1.21
>>> Emerging (115 of 135) sys-apps/man-1.6f-r4
>>> Failed to emerge sys-apps/man-1.6f-r4, Log file:
>>> '/var/tmp/portage/sys-apps/man-1.6f-r4/temp/build.log'
* Package: sys-apps/man-1.6f-r4
* Repository: gentoo
* Maintainer: base-system@gentoo.org
* USE: amd64 elibc_glibc kernel_linux multilib nls userland_GNU
* FEATURES: ccache sandbox
* Adding group 'man' to your system ...
* - Groupid: 15
/usr/portage/eclass/eutils.eclass: line 860: groupadd: command not found
* ERROR: sys-apps/man-1.6f-r4 failed (setup phase):
* enewgroup failed
*
* Call stack:
* ebuild.sh, line 56: Called pkg_setup
* man-1.6f-r4.ebuild, line 24: Called enewgroup 'man' '15'
* eutils.eclass, line 860: Called die
* The specific snippet of code:
* groupadd -r ${opts} ${egroup} || die "enewgroup failed"
*
* If you need support, post the output of 'emerge --info =sys-apps/man-1.6f-r4',
* the complete build log and the output of 'emerge -pqv =sys-apps/man-1.6f-r4'.
* The complete build log is located at '/var/tmp/portage/sys-apps/man-1.6f-r4/temp/build.log'.
* The ebuild environment file is located at '/var/tmp/portage/sys-apps/man-1.6f-r4/temp/die.env'.
* S: '/var/tmp/portage/sys-apps/man-1.6f-r4/work/man-1.6f'
* Messages for package sys-libs/timezone-data-2011e:
* You do not have TIMEZONE set in /etc/timezone.
* Skipping auto-update of /etc/localtime.
* Messages for package app-portage/portage-utils-0.3.1:
* /etc/portage/postsync.d/q-reinitialize has been installed for convenience
* If you wish for it to be automatically run at the end of every --sync:
* # chmod +x /etc/portage/postsync.d/q-reinitialize
* Normally this should only take a few seconds to run but file systems
* such as ext3 can take a lot longer. To disable, simply do:
* # chmod -x /etc/portage/postsync.d/q-reinitialize
* Messages for package sys-libs/glibc-2.11.3:
* Generating all locales; edit /etc/locale.gen to save time/space
* Messages for package sys-libs/gdbm-1.8.3-r4:
* 32bit systems might have to rebuild all gdbm databases due to
* LFS changes in the gdbm format. You can either delete the db
* and regenerate it from scratch, or use the converter:
* http://bugs.gentoo.org/attachment.cgi?id=215326
*
* See this comment for information on how to use it:
* http://bugs.gentoo.org/299390#c15
*
* You should be able to locate most gdbm db's on your system with:
* find /etc /var -type f -exec file {} + | grep 'GNU dbm 1.x or ndbm database'
*
* You could also try using this helper script:
* http://bugs.gentoo.org/attachment.cgi?id=222581
* Messages for package sys-fs/udev-151-r4:
* Unable to find kernel sources at /usr/src/linux
* Unable to calculate Linux Kernel version for build, attempting to use running version
* CONFIG_SYSFS_DEPRECATED: should not be set. But it is.
* CONFIG_SYSFS_DEPRECATED_V2: should not be set. But it is.
* Please check to make sure these options are set correctly.
* Failure to do so may cause unexpected problems.
*
* udev-151 does not support Linux kernel before version 2.6.25!
* For a reliable udev, use at least kernel 2.6.27
*
* You need to add the udev init script to the runlevel sysinit,
* else your system will not be able to boot
* after updating to >=openrc-0.4.0
* Run this to enable udev for >=openrc-0.4.0:
* rc-update add udev sysinit
*
* Auto-adding 'udev-postmount' service to your default runlevel
*
* If after the udev update removable devices or CD/DVD drives
* stop working, try re-emerging HAL before filling a bug report
*
* persistent-net does assigning fixed names to network devices.
* If you have problems with the persistent-net rules,
* just delete the rules file
* rm /etc/udev/rules.d/70-persistent-net.rules
* and then reboot.
*
* This may however number your devices in a different way than they are now.
*
* If you build an initramfs including udev, then please
* make sure that the /sbin/udevadm binary gets included,
* and your scripts changed to use it,as it replaces the
* old helper apps udevinfo, udevtrigger, ...
*
* mount options for directory /dev are no longer
* set in /etc/udev/udev.conf, but in /etc/fstab
* as for other directories.
*
* This version of udev no longer has devfs-compat enabled
* If you use /dev/md/*, /dev/loop/* or /dev/rd/*,
* then please migrate over to using the device names
* /dev/md*, /dev/loop* and /dev/ram*.
* The devfs-compat rules will be removed on the next udev update.
* For reference see Bug #269359.
*
* This version of udev no longer has use flag old-hd-rules enabled
* So all special rules for /dev/hd* devices are missing
* Please migrate to the new libata if you need these rules.
* They will be completely removed on the next udev update.
*
* For more information on udev on Gentoo, writing udev rules, and
* fixing known issues visit:
* http://www.gentoo.org/doc/en/udev-guide.xml
* Messages for package sys-apps/portage-2.1.9.42:
* If you are an ebuild developer and you plan to commit ebuilds
* with this system then please install dev-python/pycrypto or
* enable the ssl USE flag for >=dev-lang/python-2.6 in order
* to enable RMD160 hash support.
* See bug #198398 for more information.
* Messages for package app-misc/ca-certificates-20090709:
* You should run update-ca-certificates manually after etc-update
* Messages for package dev-vcs/git-1.7.3.4-r1:
* These additional scripts need some dependencies:
* git-quiltimport : dev-util/quilt
* git-instaweb : || ( www-servers/lighttpd www-servers/apache )
* Messages for package sys-apps/coreutils-8.7:
* Make sure you run 'hash -r' in your active shells.
* You should also re-source your shell settings for LS_COLORS
* changes, such as: source /etc/profile
* Messages for package net-misc/wget-1.12-r3:
* The /etc/wget/wgetrc file has been relocated to /etc/wgetrc
* Messages for package sys-fs/e2fsprogs-1.41.12:
* No /etc/mtab file, creating one temporarily
* Messages for package sys-apps/man-1.6f-r4:
* ERROR: sys-apps/man-1.6f-r4 failed (setup phase):
* enewgroup failed
*
* Call stack:
* ebuild.sh, line 56: Called pkg_setup
* man-1.6f-r4.ebuild, line 24: Called enewgroup 'man' '15'
* eutils.eclass, line 860: Called die
* The specific snippet of code:
* groupadd -r ${opts} ${egroup} || die "enewgroup failed"
*
* If you need support, post the output of 'emerge --info =sys-apps/man-1.6f-r4',
* the complete build log and the output of 'emerge -pqv =sys-apps/man-1.6f-r4'.
* The complete build log is located at '/var/tmp/portage/sys-apps/man-1.6f-r4/temp/build.log'.
* The ebuild environment file is located at '/var/tmp/portage/sys-apps/man-1.6f-r4/temp/die.env'.
* S: '/var/tmp/portage/sys-apps/man-1.6f-r4/work/man-1.6f'
* Regenerating GNU info directory index...
* Processed 74 info files.
* IMPORTANT: 2 news items need reading for repository 'gentoo'.
* Use eselect news to read news items.
!!! catalyst: run script failed.
Traceback (most recent call last):
File "modules/generic_stage_target.py", line 1207, in run_local
"run script failed.",env=self.env)
File "/usr/lib64/catalyst/modules/catalyst_support.py", line 542, in cmd
raise CatalystError,myexc
CatalystError
None
!!! catalyst: Stage build aborting due to error.
Traceback (most recent call last):
File "/usr/lib64/catalyst/catalyst", line 209, in build_target
mytarget.run()
File "modules/generic_stage_target.py", line 1263, in run
apply(getattr(self,x))
File "modules/generic_stage_target.py", line 1212, in run_local
raise CatalystError,"Stage build aborting due to error."
CatalystError
!!! catalyst: Error encountered during run of target stage3
Catalyst aborting....
lockfile does not exist '/release/buildroot/amd64-dev/tmp/hardened/stage3-amd64-hardened-20110519/.catalyst_lock'
Full build log at /tmp/catalyst-auto.24482/log/hardened_stage3.log
^ permalink raw reply [flat|nested] 24+ messages in thread
* [gentoo-releng-autobuilds] [amd64-auto] Catalyst fatal build error - hardened/stage3.spec
@ 2012-03-22 23:07 catalyst
0 siblings, 0 replies; 24+ messages in thread
From: catalyst @ 2012-03-22 23:07 UTC (permalink / raw
To: releng, gentoo-releng-autobuilds
* just delete the rules file
* rm /etc/udev/rules.d/70-persistent-net.rules
* and then reboot.
*
* This may however number your devices in a different way than they are now.
*
* If you build an initramfs including udev, then please
* make sure that the /sbin/udevadm binary gets included,
* and your scripts changed to use it,as it replaces the
* old helper apps udevinfo, udevtrigger, ...
*
* mount options for directory /dev are no longer
* set in /etc/udev/udev.conf, but in /etc/fstab
* as for other directories.
*
* If you use /dev/md/*, /dev/loop/* or /dev/rd/*,
* then please migrate over to using the device names
* /dev/md*, /dev/loop* and /dev/ram*.
* The devfs-compat rules have been removed.
* For reference see Bug #269359.
*
* Rules for /dev/hd* devices have been removed
* Please migrate to libata.
*
* For more information on udev on Gentoo, writing udev rules, and
* fixing known issues visit:
* http://www.gentoo.org/doc/en/udev-guide.xml
* Messages for package sys-apps/coreutils-8.14:
* Make sure you run 'hash -r' in your active shells.
* You should also re-source your shell settings for LS_COLORS
* changes, such as: source /etc/profile
* Messages for package net-misc/wget-1.12-r3:
* The /etc/wget/wgetrc file has been relocated to /etc/wgetrc
* Messages for package sys-fs/e2fsprogs-1.42:
* No /etc/mtab file, creating one temporarily
* Messages for package sys-apps/man-pages-3.35:
* If you don't have a makewhatis cronjob, then you
* should update the whatis database yourself:
* # makewhatis -u
* Messages for package sys-libs/pam-1.1.5:
* Some software with pre-loaded PAM libraries might experience
* warnings or failures related to missing symbols and/or versions
* after any update. While unfortunate this is a limit of the
* implementation of PAM and the software, and it requires you to
* restart the software manually after the update.
*
* You can get a list of such software running a command like
* lsof / | egrep -i 'del.*libpam\.so'
*
* Alternatively, simply reboot your system.
* Messages for package sys-auth/pambase-20101024-r2:
* Starting from version 20080801, pambase optionally enables
* SHA512-hashed passwords. For this to work, you need sys-libs/pam-1.0.1
* built against sys-libs/glibc-2.7 or later.
* If you don't have support for this, it will automatically fallback
* to MD5-hashed passwords, just like before.
*
* Please note that the change only affects the newly-changed passwords
* and that SHA512-hashed passwords will not work on earlier versions
* of glibc or Linux-PAM.
* Messages for package sys-apps/busybox-1.19.3-r1:
* Could not locate user configfile, so we will save a default one
* Your configuration for sys-apps/busybox-1.19.3-r1 has been saved in
* /etc/portage/savedconfig/sys-apps/busybox-1.19.3-r1 for your editing pleasure.
* You can edit these files by hand and remerge this package with
* USE=savedconfig to customise the configuration.
* You can rename this file/directory to one of the following for
* its configuration to apply to multiple versions:
* ${PORTAGE_CONFIGROOT}/etc/portage/savedconfig/
* [${CTARGET}|${CHOST}|""]/${CATEGORY}/[${PF}|${P}|${PN}]
* This ebuild has support for user defined configs
* Please read this ebuild for more details and re-emerge as needed
* if you want to add or remove functionality for busybox
* Messages for package net-misc/openssh-5.8_p1-r1:
* Starting with openssh-5.8p1, the server will default to a newer key
* algorithm (ECDSA). You are encouraged to manually update your stored
* keys list as servers update theirs. See ssh-keyscan(1) for more info.
* Remember to merge your config files in /etc/ssh/ and then
* reload sshd: '/etc/init.d/sshd reload'.
* Please be aware users need a valid shell in /etc/passwd
* in order to be allowed to login.
* Messages for package sys-apps/openrc-0.9.8.4:
* You should now update all files in /etc, using etc-update
* or equivalent before restarting any services or this host.
*
* Please read the migration guide available at:
* http://www.gentoo.org/doc/en/openrc-migration.xml
removing /release/buildroot/amd64-dev/tmp/hardened/stage3-amd64-hardened-20120322/tmp/chroot-functions.sh from the chroot
--- Running action sequence: preclean
copying stage3-preclean-chroot.sh to /release/buildroot/amd64-dev/tmp/hardened/stage3-amd64-hardened-20120322/tmp/
copying chroot-functions.sh to /release/buildroot/amd64-dev/tmp/hardened/stage3-amd64-hardened-20120322/tmp/
Running stage3-preclean-chroot.sh in chroot /release/buildroot/amd64-dev/tmp/hardened/stage3-amd64-hardened-20120322/
>>> Regenerating /etc/ld.so.cache...
emerge --depclean --with-bdeps=n
!!! CONFIG_PROTECT is empty
* Depclean may break link level dependencies. Thus, it is
* recommended to use a tool such as `revdep-rebuild` (from
* app-portage/gentoolkit) in order to detect such breakage.
*
* Always study the list of packages to be cleaned for any obvious
* mistakes. Packages that are part of the world set will always
* be kept. They can be manually added to this set with
* `emerge --noreplace <atom>`. Packages that are listed in
* package.provided (see portage(5)) will be removed by
* depclean, even if they are part of the world set.
*
* As a safety measure, depclean will not remove any packages
* unless *all* required dependencies have been resolved. As a
* consequence, it is often necessary to run `emerge --update
* --newuse --deep @world` prior to depclean.
!!! You have no world file.
!!! Proceeding is likely to break your installation.
Calculating dependencies \b\b... done!
* Dependencies could not be completely resolved due to
* the following required packages not being installed:
*
* >=sys-libs/ncurses-5.2[unicode] pulled in by:
* app-editors/nano-2.2.5
*
* Have you forgotten to do a complete update prior to depclean? The
* most comprehensive command for this purpose is as follows:
*
* emerge --update --newuse --deep --with-bdeps=y @world
*
* Note that the --with-bdeps=y option is not required in many
* situations. Refer to the emerge manual page (run `man emerge`)
* for more information about --with-bdeps.
*
* Also, note that it may be necessary to manually uninstall
* packages that no longer exist in the portage tree, since it may
* not be possible to satisfy their dependencies.
* IMPORTANT: 2 news items need reading for repository 'gentoo'.
* Use eselect news to read news items.
!!! catalyst: preclean script failed.
Traceback (most recent call last):
File "modules/generic_stage_target.py", line 1167, in preclean
" preclean","preclean script failed.",env=self.env)
File "/usr/lib64/catalyst/modules/catalyst_support.py", line 542, in cmd
raise CatalystError,myexc
CatalystError
None
!!! catalyst: Build failed, could not execute preclean
Traceback (most recent call last):
File "/usr/lib64/catalyst/catalyst", line 209, in build_target
mytarget.run()
File "modules/generic_stage_target.py", line 1263, in run
apply(getattr(self,x))
File "modules/generic_stage_target.py", line 1172, in preclean
raise CatalystError, "Build failed, could not execute preclean"
CatalystError
!!! catalyst: Error encountered during run of target stage3
Catalyst aborting....
lockfile does not exist '/release/buildroot/amd64-dev/tmp/hardened/stage3-amd64-hardened-20120322/.catalyst_lock'
Full build log at /tmp/catalyst-auto.16936/log/hardened_stage3.log
^ permalink raw reply [flat|nested] 24+ messages in thread
* [gentoo-releng-autobuilds] [amd64-auto] Catalyst fatal build error - hardened/stage3.spec
@ 2012-03-29 23:39 catalyst
0 siblings, 0 replies; 24+ messages in thread
From: catalyst @ 2012-03-29 23:39 UTC (permalink / raw
To: releng, gentoo-releng-autobuilds
* just delete the rules file
* rm /etc/udev/rules.d/70-persistent-net.rules
* and then reboot.
*
* This may however number your devices in a different way than they are now.
*
* If you build an initramfs including udev, then please
* make sure that the /sbin/udevadm binary gets included,
* and your scripts changed to use it,as it replaces the
* old helper apps udevinfo, udevtrigger, ...
*
* mount options for directory /dev are no longer
* set in /etc/udev/udev.conf, but in /etc/fstab
* as for other directories.
*
* If you use /dev/md/*, /dev/loop/* or /dev/rd/*,
* then please migrate over to using the device names
* /dev/md*, /dev/loop* and /dev/ram*.
* The devfs-compat rules have been removed.
* For reference see Bug #269359.
*
* Rules for /dev/hd* devices have been removed
* Please migrate to libata.
*
* For more information on udev on Gentoo, writing udev rules, and
* fixing known issues visit:
* http://www.gentoo.org/doc/en/udev-guide.xml
* Messages for package dev-vcs/git-1.7.3.4-r1:
* These additional scripts need some dependencies:
* git-quiltimport : dev-util/quilt
* git-instaweb : || ( www-servers/lighttpd www-servers/apache )
* Messages for package sys-apps/coreutils-8.14:
* Make sure you run 'hash -r' in your active shells.
* You should also re-source your shell settings for LS_COLORS
* changes, such as: source /etc/profile
* Messages for package net-misc/wget-1.12-r3:
* The /etc/wget/wgetrc file has been relocated to /etc/wgetrc
* Messages for package sys-fs/e2fsprogs-1.42:
* No /etc/mtab file, creating one temporarily
* Messages for package sys-libs/pam-1.1.5:
* Some software with pre-loaded PAM libraries might experience
* warnings or failures related to missing symbols and/or versions
* after any update. While unfortunate this is a limit of the
* implementation of PAM and the software, and it requires you to
* restart the software manually after the update.
*
* You can get a list of such software running a command like
* lsof / | egrep -i 'del.*libpam\.so'
*
* Alternatively, simply reboot your system.
* Messages for package sys-auth/pambase-20101024-r2:
* Starting from version 20080801, pambase optionally enables
* SHA512-hashed passwords. For this to work, you need sys-libs/pam-1.0.1
* built against sys-libs/glibc-2.7 or later.
* If you don't have support for this, it will automatically fallback
* to MD5-hashed passwords, just like before.
*
* Please note that the change only affects the newly-changed passwords
* and that SHA512-hashed passwords will not work on earlier versions
* of glibc or Linux-PAM.
* Messages for package sys-apps/openrc-0.9.8.4:
* You should now update all files in /etc, using etc-update
* or equivalent before restarting any services or this host.
*
* Please read the migration guide available at:
* http://www.gentoo.org/doc/en/openrc-migration.xml
* Messages for package sys-apps/busybox-1.19.3-r1:
* Could not locate user configfile, so we will save a default one
* Your configuration for sys-apps/busybox-1.19.3-r1 has been saved in
* /etc/portage/savedconfig/sys-apps/busybox-1.19.3-r1 for your editing pleasure.
* You can edit these files by hand and remerge this package with
* USE=savedconfig to customise the configuration.
* You can rename this file/directory to one of the following for
* its configuration to apply to multiple versions:
* ${PORTAGE_CONFIGROOT}/etc/portage/savedconfig/
* [${CTARGET}|${CHOST}|""]/${CATEGORY}/[${PF}|${P}|${PN}]
* This ebuild has support for user defined configs
* Please read this ebuild for more details and re-emerge as needed
* if you want to add or remove functionality for busybox
* Messages for package net-misc/openssh-5.8_p1-r1:
* Starting with openssh-5.8p1, the server will default to a newer key
* algorithm (ECDSA). You are encouraged to manually update your stored
* keys list as servers update theirs. See ssh-keyscan(1) for more info.
* Remember to merge your config files in /etc/ssh/ and then
* reload sshd: '/etc/init.d/sshd reload'.
* Please be aware users need a valid shell in /etc/passwd
* in order to be allowed to login.
removing /release/buildroot/amd64-dev/tmp/hardened/stage3-amd64-hardened-20120329/tmp/chroot-functions.sh from the chroot
--- Running action sequence: preclean
copying stage3-preclean-chroot.sh to /release/buildroot/amd64-dev/tmp/hardened/stage3-amd64-hardened-20120329/tmp/
copying chroot-functions.sh to /release/buildroot/amd64-dev/tmp/hardened/stage3-amd64-hardened-20120329/tmp/
Running stage3-preclean-chroot.sh in chroot /release/buildroot/amd64-dev/tmp/hardened/stage3-amd64-hardened-20120329/
>>> Regenerating /etc/ld.so.cache...
emerge --depclean --with-bdeps=n
!!! CONFIG_PROTECT is empty
* Depclean may break link level dependencies. Thus, it is
* recommended to use a tool such as `revdep-rebuild` (from
* app-portage/gentoolkit) in order to detect such breakage.
*
* Always study the list of packages to be cleaned for any obvious
* mistakes. Packages that are part of the world set will always
* be kept. They can be manually added to this set with
* `emerge --noreplace <atom>`. Packages that are listed in
* package.provided (see portage(5)) will be removed by
* depclean, even if they are part of the world set.
*
* As a safety measure, depclean will not remove any packages
* unless *all* required dependencies have been resolved. As a
* consequence, it is often necessary to run `emerge --update
* --newuse --deep @world` prior to depclean.
!!! You have no world file.
!!! Proceeding is likely to break your installation.
Calculating dependencies \b\b... done!
* Dependencies could not be completely resolved due to
* the following required packages not being installed:
*
* >=sys-libs/ncurses-5.2[unicode] pulled in by:
* app-editors/nano-2.2.5
*
* Have you forgotten to do a complete update prior to depclean? The
* most comprehensive command for this purpose is as follows:
*
* emerge --update --newuse --deep --with-bdeps=y @world
*
* Note that the --with-bdeps=y option is not required in many
* situations. Refer to the emerge manual page (run `man emerge`)
* for more information about --with-bdeps.
*
* Also, note that it may be necessary to manually uninstall
* packages that no longer exist in the portage tree, since it may
* not be possible to satisfy their dependencies.
* IMPORTANT: 2 news items need reading for repository 'gentoo'.
* Use eselect news to read news items.
!!! catalyst: preclean script failed.
Traceback (most recent call last):
File "modules/generic_stage_target.py", line 1167, in preclean
" preclean","preclean script failed.",env=self.env)
File "/usr/lib64/catalyst/modules/catalyst_support.py", line 542, in cmd
raise CatalystError,myexc
CatalystError
None
!!! catalyst: Build failed, could not execute preclean
Traceback (most recent call last):
File "/usr/lib64/catalyst/catalyst", line 209, in build_target
mytarget.run()
File "modules/generic_stage_target.py", line 1263, in run
apply(getattr(self,x))
File "modules/generic_stage_target.py", line 1172, in preclean
raise CatalystError, "Build failed, could not execute preclean"
CatalystError
!!! catalyst: Error encountered during run of target stage3
Catalyst aborting....
lockfile does not exist '/release/buildroot/amd64-dev/tmp/hardened/stage3-amd64-hardened-20120329/.catalyst_lock'
Full build log at /tmp/catalyst-auto.16574/log/hardened_stage3.log
^ permalink raw reply [flat|nested] 24+ messages in thread
* [gentoo-releng-autobuilds] [amd64-auto] Catalyst fatal build error - hardened/stage3.spec
@ 2012-04-05 23:35 catalyst
0 siblings, 0 replies; 24+ messages in thread
From: catalyst @ 2012-04-05 23:35 UTC (permalink / raw
To: releng, gentoo-releng-autobuilds
* just delete the rules file
* rm /etc/udev/rules.d/70-persistent-net.rules
* and then reboot.
*
* This may however number your devices in a different way than they are now.
*
* If you build an initramfs including udev, then please
* make sure that the /sbin/udevadm binary gets included,
* and your scripts changed to use it,as it replaces the
* old helper apps udevinfo, udevtrigger, ...
*
* mount options for directory /dev are no longer
* set in /etc/udev/udev.conf, but in /etc/fstab
* as for other directories.
*
* If you use /dev/md/*, /dev/loop/* or /dev/rd/*,
* then please migrate over to using the device names
* /dev/md*, /dev/loop* and /dev/ram*.
* The devfs-compat rules have been removed.
* For reference see Bug #269359.
*
* Rules for /dev/hd* devices have been removed
* Please migrate to libata.
*
* For more information on udev on Gentoo, writing udev rules, and
* fixing known issues visit:
* http://www.gentoo.org/doc/en/udev-guide.xml
* Messages for package dev-vcs/git-1.7.3.4-r1:
* These additional scripts need some dependencies:
* git-quiltimport : dev-util/quilt
* git-instaweb : || ( www-servers/lighttpd www-servers/apache )
* Messages for package sys-apps/coreutils-8.14:
* Make sure you run 'hash -r' in your active shells.
* You should also re-source your shell settings for LS_COLORS
* changes, such as: source /etc/profile
* Messages for package net-misc/wget-1.12-r3:
* The /etc/wget/wgetrc file has been relocated to /etc/wgetrc
* Messages for package sys-fs/e2fsprogs-1.42:
* No /etc/mtab file, creating one temporarily
* Messages for package sys-libs/pam-1.1.5:
* Some software with pre-loaded PAM libraries might experience
* warnings or failures related to missing symbols and/or versions
* after any update. While unfortunate this is a limit of the
* implementation of PAM and the software, and it requires you to
* restart the software manually after the update.
*
* You can get a list of such software running a command like
* lsof / | egrep -i 'del.*libpam\.so'
*
* Alternatively, simply reboot your system.
* Messages for package sys-auth/pambase-20101024-r2:
* Starting from version 20080801, pambase optionally enables
* SHA512-hashed passwords. For this to work, you need sys-libs/pam-1.0.1
* built against sys-libs/glibc-2.7 or later.
* If you don't have support for this, it will automatically fallback
* to MD5-hashed passwords, just like before.
*
* Please note that the change only affects the newly-changed passwords
* and that SHA512-hashed passwords will not work on earlier versions
* of glibc or Linux-PAM.
* Messages for package sys-apps/openrc-0.9.8.4:
* You should now update all files in /etc, using etc-update
* or equivalent before restarting any services or this host.
*
* Please read the migration guide available at:
* http://www.gentoo.org/doc/en/openrc-migration.xml
* Messages for package sys-apps/busybox-1.19.3-r1:
* Could not locate user configfile, so we will save a default one
* Your configuration for sys-apps/busybox-1.19.3-r1 has been saved in
* /etc/portage/savedconfig/sys-apps/busybox-1.19.3-r1 for your editing pleasure.
* You can edit these files by hand and remerge this package with
* USE=savedconfig to customise the configuration.
* You can rename this file/directory to one of the following for
* its configuration to apply to multiple versions:
* ${PORTAGE_CONFIGROOT}/etc/portage/savedconfig/
* [${CTARGET}|${CHOST}|""]/${CATEGORY}/[${PF}|${P}|${PN}]
* This ebuild has support for user defined configs
* Please read this ebuild for more details and re-emerge as needed
* if you want to add or remove functionality for busybox
* Messages for package net-misc/openssh-5.8_p1-r1:
* Starting with openssh-5.8p1, the server will default to a newer key
* algorithm (ECDSA). You are encouraged to manually update your stored
* keys list as servers update theirs. See ssh-keyscan(1) for more info.
* Remember to merge your config files in /etc/ssh/ and then
* reload sshd: '/etc/init.d/sshd reload'.
* Please be aware users need a valid shell in /etc/passwd
* in order to be allowed to login.
removing /release/buildroot/amd64-dev/tmp/hardened/stage3-amd64-hardened-20120405/tmp/chroot-functions.sh from the chroot
--- Running action sequence: preclean
copying stage3-preclean-chroot.sh to /release/buildroot/amd64-dev/tmp/hardened/stage3-amd64-hardened-20120405/tmp/
copying chroot-functions.sh to /release/buildroot/amd64-dev/tmp/hardened/stage3-amd64-hardened-20120405/tmp/
Running stage3-preclean-chroot.sh in chroot /release/buildroot/amd64-dev/tmp/hardened/stage3-amd64-hardened-20120405/
>>> Regenerating /etc/ld.so.cache...
emerge --depclean --with-bdeps=n
!!! CONFIG_PROTECT is empty
* Depclean may break link level dependencies. Thus, it is
* recommended to use a tool such as `revdep-rebuild` (from
* app-portage/gentoolkit) in order to detect such breakage.
*
* Always study the list of packages to be cleaned for any obvious
* mistakes. Packages that are part of the world set will always
* be kept. They can be manually added to this set with
* `emerge --noreplace <atom>`. Packages that are listed in
* package.provided (see portage(5)) will be removed by
* depclean, even if they are part of the world set.
*
* As a safety measure, depclean will not remove any packages
* unless *all* required dependencies have been resolved. As a
* consequence, it is often necessary to run `emerge --update
* --newuse --deep @world` prior to depclean.
!!! You have no world file.
!!! Proceeding is likely to break your installation.
Calculating dependencies \b\b... done!
* Dependencies could not be completely resolved due to
* the following required packages not being installed:
*
* >=sys-libs/ncurses-5.2[unicode] pulled in by:
* app-editors/nano-2.2.5
*
* Have you forgotten to do a complete update prior to depclean? The
* most comprehensive command for this purpose is as follows:
*
* emerge --update --newuse --deep --with-bdeps=y @world
*
* Note that the --with-bdeps=y option is not required in many
* situations. Refer to the emerge manual page (run `man emerge`)
* for more information about --with-bdeps.
*
* Also, note that it may be necessary to manually uninstall
* packages that no longer exist in the portage tree, since it may
* not be possible to satisfy their dependencies.
* IMPORTANT: 2 news items need reading for repository 'gentoo'.
* Use eselect news to read news items.
!!! catalyst: preclean script failed.
Traceback (most recent call last):
File "modules/generic_stage_target.py", line 1167, in preclean
" preclean","preclean script failed.",env=self.env)
File "/usr/lib64/catalyst/modules/catalyst_support.py", line 542, in cmd
raise CatalystError,myexc
CatalystError
None
!!! catalyst: Build failed, could not execute preclean
Traceback (most recent call last):
File "/usr/lib64/catalyst/catalyst", line 209, in build_target
mytarget.run()
File "modules/generic_stage_target.py", line 1263, in run
apply(getattr(self,x))
File "modules/generic_stage_target.py", line 1172, in preclean
raise CatalystError, "Build failed, could not execute preclean"
CatalystError
!!! catalyst: Error encountered during run of target stage3
Catalyst aborting....
lockfile does not exist '/release/buildroot/amd64-dev/tmp/hardened/stage3-amd64-hardened-20120405/.catalyst_lock'
Full build log at /tmp/catalyst-auto.25708/log/hardened_stage3.log
^ permalink raw reply [flat|nested] 24+ messages in thread
* [gentoo-releng-autobuilds] [amd64-auto] Catalyst fatal build error - hardened/stage3.spec
@ 2012-04-12 23:42 catalyst
0 siblings, 0 replies; 24+ messages in thread
From: catalyst @ 2012-04-12 23:42 UTC (permalink / raw
To: releng, gentoo-releng-autobuilds
* just delete the rules file
* rm /etc/udev/rules.d/70-persistent-net.rules
* and then reboot.
*
* This may however number your devices in a different way than they are now.
*
* If you build an initramfs including udev, then please
* make sure that the /sbin/udevadm binary gets included,
* and your scripts changed to use it,as it replaces the
* old helper apps udevinfo, udevtrigger, ...
*
* mount options for directory /dev are no longer
* set in /etc/udev/udev.conf, but in /etc/fstab
* as for other directories.
*
* If you use /dev/md/*, /dev/loop/* or /dev/rd/*,
* then please migrate over to using the device names
* /dev/md*, /dev/loop* and /dev/ram*.
* The devfs-compat rules have been removed.
* For reference see Bug #269359.
*
* Rules for /dev/hd* devices have been removed
* Please migrate to libata.
*
* For more information on udev on Gentoo, writing udev rules, and
* fixing known issues visit:
* http://www.gentoo.org/doc/en/udev-guide.xml
* Messages for package dev-vcs/git-1.7.3.4-r1:
* These additional scripts need some dependencies:
* git-quiltimport : dev-util/quilt
* git-instaweb : || ( www-servers/lighttpd www-servers/apache )
* Messages for package sys-apps/coreutils-8.14:
* Make sure you run 'hash -r' in your active shells.
* You should also re-source your shell settings for LS_COLORS
* changes, such as: source /etc/profile
* Messages for package net-misc/wget-1.12-r3:
* The /etc/wget/wgetrc file has been relocated to /etc/wgetrc
* Messages for package sys-fs/e2fsprogs-1.42:
* No /etc/mtab file, creating one temporarily
* Messages for package sys-libs/pam-1.1.5:
* Some software with pre-loaded PAM libraries might experience
* warnings or failures related to missing symbols and/or versions
* after any update. While unfortunate this is a limit of the
* implementation of PAM and the software, and it requires you to
* restart the software manually after the update.
*
* You can get a list of such software running a command like
* lsof / | egrep -i 'del.*libpam\.so'
*
* Alternatively, simply reboot your system.
* Messages for package sys-auth/pambase-20101024-r2:
* Starting from version 20080801, pambase optionally enables
* SHA512-hashed passwords. For this to work, you need sys-libs/pam-1.0.1
* built against sys-libs/glibc-2.7 or later.
* If you don't have support for this, it will automatically fallback
* to MD5-hashed passwords, just like before.
*
* Please note that the change only affects the newly-changed passwords
* and that SHA512-hashed passwords will not work on earlier versions
* of glibc or Linux-PAM.
* Messages for package sys-apps/openrc-0.9.8.4:
* You should now update all files in /etc, using etc-update
* or equivalent before restarting any services or this host.
*
* Please read the migration guide available at:
* http://www.gentoo.org/doc/en/openrc-migration.xml
* Messages for package sys-apps/busybox-1.19.3-r1:
* Could not locate user configfile, so we will save a default one
* Your configuration for sys-apps/busybox-1.19.3-r1 has been saved in
* /etc/portage/savedconfig/sys-apps/busybox-1.19.3-r1 for your editing pleasure.
* You can edit these files by hand and remerge this package with
* USE=savedconfig to customise the configuration.
* You can rename this file/directory to one of the following for
* its configuration to apply to multiple versions:
* ${PORTAGE_CONFIGROOT}/etc/portage/savedconfig/
* [${CTARGET}|${CHOST}|""]/${CATEGORY}/[${PF}|${P}|${PN}]
* This ebuild has support for user defined configs
* Please read this ebuild for more details and re-emerge as needed
* if you want to add or remove functionality for busybox
* Messages for package net-misc/openssh-5.9_p1-r4:
* Starting with openssh-5.8p1, the server will default to a newer key
* algorithm (ECDSA). You are encouraged to manually update your stored
* keys list as servers update theirs. See ssh-keyscan(1) for more info.
* Remember to merge your config files in /etc/ssh/ and then
* reload sshd: '/etc/init.d/sshd reload'.
* Please be aware users need a valid shell in /etc/passwd
* in order to be allowed to login.
removing /release/buildroot/amd64-dev/tmp/hardened/stage3-amd64-hardened-20120412/tmp/chroot-functions.sh from the chroot
--- Running action sequence: preclean
copying stage3-preclean-chroot.sh to /release/buildroot/amd64-dev/tmp/hardened/stage3-amd64-hardened-20120412/tmp/
copying chroot-functions.sh to /release/buildroot/amd64-dev/tmp/hardened/stage3-amd64-hardened-20120412/tmp/
Running stage3-preclean-chroot.sh in chroot /release/buildroot/amd64-dev/tmp/hardened/stage3-amd64-hardened-20120412/
>>> Regenerating /etc/ld.so.cache...
emerge --depclean --with-bdeps=n
!!! CONFIG_PROTECT is empty
* Depclean may break link level dependencies. Thus, it is
* recommended to use a tool such as `revdep-rebuild` (from
* app-portage/gentoolkit) in order to detect such breakage.
*
* Always study the list of packages to be cleaned for any obvious
* mistakes. Packages that are part of the world set will always
* be kept. They can be manually added to this set with
* `emerge --noreplace <atom>`. Packages that are listed in
* package.provided (see portage(5)) will be removed by
* depclean, even if they are part of the world set.
*
* As a safety measure, depclean will not remove any packages
* unless *all* required dependencies have been resolved. As a
* consequence, it is often necessary to run `emerge --update
* --newuse --deep @world` prior to depclean.
!!! You have no world file.
!!! Proceeding is likely to break your installation.
Calculating dependencies \b\b... done!
* Dependencies could not be completely resolved due to
* the following required packages not being installed:
*
* >=sys-libs/ncurses-5.2[unicode] pulled in by:
* app-editors/nano-2.2.5
*
* Have you forgotten to do a complete update prior to depclean? The
* most comprehensive command for this purpose is as follows:
*
* emerge --update --newuse --deep --with-bdeps=y @world
*
* Note that the --with-bdeps=y option is not required in many
* situations. Refer to the emerge manual page (run `man emerge`)
* for more information about --with-bdeps.
*
* Also, note that it may be necessary to manually uninstall
* packages that no longer exist in the portage tree, since it may
* not be possible to satisfy their dependencies.
* IMPORTANT: 2 news items need reading for repository 'gentoo'.
* Use eselect news to read news items.
!!! catalyst: preclean script failed.
Traceback (most recent call last):
File "modules/generic_stage_target.py", line 1167, in preclean
" preclean","preclean script failed.",env=self.env)
File "/usr/lib64/catalyst/modules/catalyst_support.py", line 542, in cmd
raise CatalystError,myexc
CatalystError
None
!!! catalyst: Build failed, could not execute preclean
Traceback (most recent call last):
File "/usr/lib64/catalyst/catalyst", line 209, in build_target
mytarget.run()
File "modules/generic_stage_target.py", line 1263, in run
apply(getattr(self,x))
File "modules/generic_stage_target.py", line 1172, in preclean
raise CatalystError, "Build failed, could not execute preclean"
CatalystError
!!! catalyst: Error encountered during run of target stage3
Catalyst aborting....
lockfile does not exist '/release/buildroot/amd64-dev/tmp/hardened/stage3-amd64-hardened-20120412/.catalyst_lock'
Full build log at /tmp/catalyst-auto.32109/log/hardened_stage3.log
^ permalink raw reply [flat|nested] 24+ messages in thread
* [gentoo-releng-autobuilds] [amd64-auto] Catalyst fatal build error - hardened/stage3.spec
@ 2012-04-19 23:39 catalyst
0 siblings, 0 replies; 24+ messages in thread
From: catalyst @ 2012-04-19 23:39 UTC (permalink / raw
To: releng, gentoo-releng-autobuilds
* just delete the rules file
* rm /etc/udev/rules.d/70-persistent-net.rules
* and then reboot.
*
* This may however number your devices in a different way than they are now.
*
* If you build an initramfs including udev, then please
* make sure that the /sbin/udevadm binary gets included,
* and your scripts changed to use it,as it replaces the
* old helper apps udevinfo, udevtrigger, ...
*
* mount options for directory /dev are no longer
* set in /etc/udev/udev.conf, but in /etc/fstab
* as for other directories.
*
* If you use /dev/md/*, /dev/loop/* or /dev/rd/*,
* then please migrate over to using the device names
* /dev/md*, /dev/loop* and /dev/ram*.
* The devfs-compat rules have been removed.
* For reference see Bug #269359.
*
* Rules for /dev/hd* devices have been removed
* Please migrate to libata.
*
* For more information on udev on Gentoo, writing udev rules, and
* fixing known issues visit:
* http://www.gentoo.org/doc/en/udev-guide.xml
* Messages for package dev-vcs/git-1.7.3.4-r1:
* These additional scripts need some dependencies:
* git-quiltimport : dev-util/quilt
* git-instaweb : || ( www-servers/lighttpd www-servers/apache )
* Messages for package sys-apps/coreutils-8.14:
* Make sure you run 'hash -r' in your active shells.
* You should also re-source your shell settings for LS_COLORS
* changes, such as: source /etc/profile
* Messages for package net-misc/wget-1.12-r3:
* The /etc/wget/wgetrc file has been relocated to /etc/wgetrc
* Messages for package sys-fs/e2fsprogs-1.42:
* No /etc/mtab file, creating one temporarily
* Messages for package sys-libs/pam-1.1.5:
* Some software with pre-loaded PAM libraries might experience
* warnings or failures related to missing symbols and/or versions
* after any update. While unfortunate this is a limit of the
* implementation of PAM and the software, and it requires you to
* restart the software manually after the update.
*
* You can get a list of such software running a command like
* lsof / | egrep -i 'del.*libpam\.so'
*
* Alternatively, simply reboot your system.
* Messages for package sys-auth/pambase-20101024-r2:
* Starting from version 20080801, pambase optionally enables
* SHA512-hashed passwords. For this to work, you need sys-libs/pam-1.0.1
* built against sys-libs/glibc-2.7 or later.
* If you don't have support for this, it will automatically fallback
* to MD5-hashed passwords, just like before.
*
* Please note that the change only affects the newly-changed passwords
* and that SHA512-hashed passwords will not work on earlier versions
* of glibc or Linux-PAM.
* Messages for package sys-apps/openrc-0.9.8.4:
* You should now update all files in /etc, using etc-update
* or equivalent before restarting any services or this host.
*
* Please read the migration guide available at:
* http://www.gentoo.org/doc/en/openrc-migration.xml
* Messages for package sys-apps/busybox-1.19.3-r1:
* Could not locate user configfile, so we will save a default one
* Your configuration for sys-apps/busybox-1.19.3-r1 has been saved in
* /etc/portage/savedconfig/sys-apps/busybox-1.19.3-r1 for your editing pleasure.
* You can edit these files by hand and remerge this package with
* USE=savedconfig to customise the configuration.
* You can rename this file/directory to one of the following for
* its configuration to apply to multiple versions:
* ${PORTAGE_CONFIGROOT}/etc/portage/savedconfig/
* [${CTARGET}|${CHOST}|""]/${CATEGORY}/[${PF}|${P}|${PN}]
* This ebuild has support for user defined configs
* Please read this ebuild for more details and re-emerge as needed
* if you want to add or remove functionality for busybox
* Messages for package net-misc/openssh-5.9_p1-r4:
* Starting with openssh-5.8p1, the server will default to a newer key
* algorithm (ECDSA). You are encouraged to manually update your stored
* keys list as servers update theirs. See ssh-keyscan(1) for more info.
* Remember to merge your config files in /etc/ssh/ and then
* reload sshd: '/etc/init.d/sshd reload'.
* Please be aware users need a valid shell in /etc/passwd
* in order to be allowed to login.
removing /release/buildroot/amd64-dev/tmp/hardened/stage3-amd64-hardened-20120419/tmp/chroot-functions.sh from the chroot
--- Running action sequence: preclean
copying stage3-preclean-chroot.sh to /release/buildroot/amd64-dev/tmp/hardened/stage3-amd64-hardened-20120419/tmp/
copying chroot-functions.sh to /release/buildroot/amd64-dev/tmp/hardened/stage3-amd64-hardened-20120419/tmp/
Running stage3-preclean-chroot.sh in chroot /release/buildroot/amd64-dev/tmp/hardened/stage3-amd64-hardened-20120419/
>>> Regenerating /etc/ld.so.cache...
emerge --depclean --with-bdeps=n
!!! CONFIG_PROTECT is empty
* Depclean may break link level dependencies. Thus, it is
* recommended to use a tool such as `revdep-rebuild` (from
* app-portage/gentoolkit) in order to detect such breakage.
*
* Always study the list of packages to be cleaned for any obvious
* mistakes. Packages that are part of the world set will always
* be kept. They can be manually added to this set with
* `emerge --noreplace <atom>`. Packages that are listed in
* package.provided (see portage(5)) will be removed by
* depclean, even if they are part of the world set.
*
* As a safety measure, depclean will not remove any packages
* unless *all* required dependencies have been resolved. As a
* consequence, it is often necessary to run `emerge --update
* --newuse --deep @world` prior to depclean.
!!! You have no world file.
!!! Proceeding is likely to break your installation.
Calculating dependencies \b\b... done!
* Dependencies could not be completely resolved due to
* the following required packages not being installed:
*
* >=sys-libs/ncurses-5.2[unicode] pulled in by:
* app-editors/nano-2.2.5
*
* Have you forgotten to do a complete update prior to depclean? The
* most comprehensive command for this purpose is as follows:
*
* emerge --update --newuse --deep --with-bdeps=y @world
*
* Note that the --with-bdeps=y option is not required in many
* situations. Refer to the emerge manual page (run `man emerge`)
* for more information about --with-bdeps.
*
* Also, note that it may be necessary to manually uninstall
* packages that no longer exist in the portage tree, since it may
* not be possible to satisfy their dependencies.
* IMPORTANT: 2 news items need reading for repository 'gentoo'.
* Use eselect news to read news items.
!!! catalyst: preclean script failed.
Traceback (most recent call last):
File "modules/generic_stage_target.py", line 1167, in preclean
" preclean","preclean script failed.",env=self.env)
File "/usr/lib64/catalyst/modules/catalyst_support.py", line 542, in cmd
raise CatalystError,myexc
CatalystError
None
!!! catalyst: Build failed, could not execute preclean
Traceback (most recent call last):
File "/usr/lib64/catalyst/catalyst", line 209, in build_target
mytarget.run()
File "modules/generic_stage_target.py", line 1263, in run
apply(getattr(self,x))
File "modules/generic_stage_target.py", line 1172, in preclean
raise CatalystError, "Build failed, could not execute preclean"
CatalystError
!!! catalyst: Error encountered during run of target stage3
Catalyst aborting....
lockfile does not exist '/release/buildroot/amd64-dev/tmp/hardened/stage3-amd64-hardened-20120419/.catalyst_lock'
Full build log at /tmp/catalyst-auto.22699/log/hardened_stage3.log
^ permalink raw reply [flat|nested] 24+ messages in thread
* [gentoo-releng-autobuilds] [amd64-auto] Catalyst fatal build error - hardened/stage3.spec
@ 2012-06-07 13:44 catalyst
0 siblings, 0 replies; 24+ messages in thread
From: catalyst @ 2012-06-07 13:44 UTC (permalink / raw
To: releng, gentoo-releng-autobuilds
>>> Emerging (69 of 119) sys-apps/less-444
>>> Installing (69 of 119) sys-apps/less-444
>>> Emerging (70 of 119) virtual/pager-0
>>> Installing (70 of 119) virtual/pager-0
>>> Emerging (71 of 119) sys-libs/gpm-1.20.6
>>> Installing (71 of 119) sys-libs/gpm-1.20.6
>>> Emerging (72 of 119) sys-libs/ncurses-5.9-r2
>>> Installing (72 of 119) sys-libs/ncurses-5.9-r2
>>> Emerging (73 of 119) sys-process/procps-3.2.8_p11
>>> Installing (73 of 119) sys-process/procps-3.2.8_p11
>>> Emerging (74 of 119) sys-apps/attr-2.4.46-r1
>>> Installing (74 of 119) sys-apps/attr-2.4.46-r1
>>> Emerging (75 of 119) sys-apps/acl-2.2.51
>>> Installing (75 of 119) sys-apps/acl-2.2.51
>>> Emerging (76 of 119) virtual/acl-0-r1
>>> Installing (76 of 119) virtual/acl-0-r1
>>> Emerging (77 of 119) sys-devel/gettext-0.18.1.1-r1
>>> Installing (77 of 119) sys-devel/gettext-0.18.1.1-r1
>>> Emerging (78 of 119) sys-apps/sed-4.2.1
>>> Installing (78 of 119) sys-apps/sed-4.2.1
>>> Emerging (79 of 119) sys-devel/bison-2.4.3
>>> Installing (79 of 119) sys-devel/bison-2.4.3
>>> Emerging (80 of 119) dev-perl/Locale-gettext-1.50.0
>>> Installing (80 of 119) dev-perl/Locale-gettext-1.50.0
>>> Emerging (81 of 119) sys-apps/help2man-1.40.8
>>> Installing (81 of 119) sys-apps/help2man-1.40.8
>>> Emerging (82 of 119) sys-devel/automake-1.11.1
>>> Installing (82 of 119) sys-devel/automake-1.11.1
>>> Emerging (83 of 119) sys-devel/libtool-2.4-r1
>>> Installing (83 of 119) sys-devel/libtool-2.4-r1
>>> Emerging (84 of 119) sys-apps/groff-1.21
>>> Installing (84 of 119) sys-apps/groff-1.21
>>> Emerging (85 of 119) sys-apps/man-1.6g
>>> Installing (85 of 119) sys-apps/man-1.6g
>>> Emerging (86 of 119) virtual/man-0
>>> Installing (86 of 119) virtual/man-0
>>> Emerging (87 of 119) sys-apps/man-pages-posix-2003a
>>> Installing (87 of 119) sys-apps/man-pages-posix-2003a
>>> Emerging (88 of 119) sys-devel/flex-2.5.35_p10
>>> Installing (88 of 119) sys-devel/flex-2.5.35_p10
>>> Emerging (89 of 119) dev-libs/glib-2.30.3
>>> Failed to emerge dev-libs/glib-2.30.3, Log file:
>>> '/var/tmp/portage/dev-libs/glib-2.30.3/temp/build.log'
* Package: dev-libs/glib-2.30.3
* Repository: gentoo
* USE: amd64 elibc_glibc kernel_linux multilib static-libs userland_GNU
* FEATURES: ccache sandbox
`/var/tmp/portage/dev-libs/glib-2.30.3/work/pkg-config-0.26/pkg.m4' -> `/var/tmp/portage/dev-libs/glib-2.30.3/work/pkg.m4'
* Applying glib-2.30.2-missing-decls.patch ...
[ ok ]
* Applying glib-2.12.12-fbsd.patch ...
[ ok ]
* Applying glib-2.30.3-assert-test-failure.patch ...
[ ok ]
* Applying glib-2.30.1-external-gdbus-codegen.patch ...
[ ok ]
* Applying glib-2.30.1-homedir-env.patch ...
[ ok ]
* Applying glib-2.30.2-machine-id.patch ...
[ ok ]
* Applying glib-2.30.3-closure-64bit-be.patch ...
[ ok ]
* Running eautoreconf in '/var/tmp/portage/dev-libs/glib-2.30.3/work/glib-2.30.3' ...
* Running gtkdocize --copy ...
[ !! ]
* Failed Running gtkdocize !
*
* Include in your bugreport the contents of:
*
* /var/tmp/portage/dev-libs/glib-2.30.3/temp/gtkdocize.out
* ERROR: dev-libs/glib-2.30.3 failed (prepare phase):
* Failed Running gtkdocize !
*
* Call stack:
* ebuild.sh, line 85: Called src_prepare
* environment, line 6148: Called eautoreconf
* environment, line 1605: Called autotools_run_tool 'gtkdocize' '--copy'
* environment, line 1383: Called die
* The specific snippet of code:
* die "Failed Running $1 !";
*
* If you need support, post the output of 'emerge --info =dev-libs/glib-2.30.3',
* the complete build log and the output of 'emerge -pqv =dev-libs/glib-2.30.3'.
* The complete build log is located at '/var/tmp/portage/dev-libs/glib-2.30.3/temp/build.log'.
* The ebuild environment file is located at '/var/tmp/portage/dev-libs/glib-2.30.3/temp/environment'.
* S: '/var/tmp/portage/dev-libs/glib-2.30.3/work/glib-2.30.3'
* Messages for package sys-libs/timezone-data-2012c:
* You do not have TIMEZONE set in /etc/timezone.
* Skipping auto-update of /etc/localtime.
* Messages for package app-portage/portage-utils-0.10:
* /etc/portage/postsync.d/q-reinitialize has been installed for convenience
* If you wish for it to be automatically run at the end of every --sync:
* # chmod +x /etc/portage/postsync.d/q-reinitialize
* Normally this should only take a few seconds to run but file systems
* such as ext3 can take a lot longer. To disable, simply do:
* # chmod -x /etc/portage/postsync.d/q-reinitialize
* Messages for package sys-apps/baselayout-2.1-r1:
* You should reboot the system now to get /run mounted with tmpfs!
* Messages for package sys-libs/glibc-2.14.1-r3:
* Generating all locales; edit /etc/locale.gen to save time/space
* Messages for package sys-libs/gdbm-1.8.3-r4:
* 32bit systems might have to rebuild all gdbm databases due to
* LFS changes in the gdbm format. You can either delete the db
* and regenerate it from scratch, or use the converter:
* http://bugs.gentoo.org/attachment.cgi?id=215326
*
* See this comment for information on how to use it:
* http://bugs.gentoo.org/299390#c15
*
* You should be able to locate most gdbm db's on your system with:
* find /etc /var -type f -exec file {} + | grep 'GNU dbm 1.x or ndbm database'
*
* You could also try using this helper script:
* http://bugs.gentoo.org/attachment.cgi?id=222581
* Messages for package sys-apps/util-linux-2.20.1-r1:
* The agetty util now clears the terminal by default. You
* might want to add --noclear to your /etc/inittab lines.
* Messages for package sys-devel/gcc-4.5.3-r2:
* If you have issues with packages unable to locate libstdc++.la,
* then try running 'fix_libtool_files.sh' on the old gcc versions.
* You might want to review the GCC upgrade guide when moving between
* major versions (like 4.2 to 4.3):
* http://www.gentoo.org/doc/en/gcc-upgrading.xml
* Messages for package sys-apps/portage-2.1.10.49:
* If you are an ebuild developer and you plan to commit ebuilds
* with this system then please install dev-python/pycrypto or
* enable the ssl USE flag for >=dev-lang/python-2.6 in order
* to enable RMD160 hash support.
* See bug #198398 for more information.
* Messages for package app-misc/ca-certificates-20111025:
* You should run update-ca-certificates manually after etc-update
* Messages for package dev-libs/glib-2.30.3:
* Failed Running gtkdocize !
*
* Include in your bugreport the contents of:
*
* /var/tmp/portage/dev-libs/glib-2.30.3/temp/gtkdocize.out
* ERROR: dev-libs/glib-2.30.3 failed (prepare phase):
* Failed Running gtkdocize !
*
* Call stack:
* ebuild.sh, line 85: Called src_prepare
* environment, line 6148: Called eautoreconf
* environment, line 1605: Called autotools_run_tool 'gtkdocize' '--copy'
* environment, line 1383: Called die
* The specific snippet of code:
* die "Failed Running $1 !";
*
* If you need support, post the output of 'emerge --info =dev-libs/glib-2.30.3',
* the complete build log and the output of 'emerge -pqv =dev-libs/glib-2.30.3'.
* The complete build log is located at '/var/tmp/portage/dev-libs/glib-2.30.3/temp/build.log'.
* The ebuild environment file is located at '/var/tmp/portage/dev-libs/glib-2.30.3/temp/environment'.
* S: '/var/tmp/portage/dev-libs/glib-2.30.3/work/glib-2.30.3'
!!! catalyst: run script failed.
Traceback (most recent call last):
File "modules/generic_stage_target.py", line 1207, in run_local
"run script failed.",env=self.env)
File "/usr/lib64/catalyst/modules/catalyst_support.py", line 542, in cmd
raise CatalystError,myexc
CatalystError
None
!!! catalyst: Stage build aborting due to error.
Traceback (most recent call last):
File "/usr/lib64/catalyst/catalyst", line 209, in build_target
mytarget.run()
File "modules/generic_stage_target.py", line 1263, in run
apply(getattr(self,x))
File "modules/generic_stage_target.py", line 1212, in run_local
raise CatalystError,"Stage build aborting due to error."
CatalystError
!!! catalyst: Error encountered during run of target stage3
Catalyst aborting....
lockfile does not exist '/release/buildroot/amd64-dev/tmp/hardened/stage3-amd64-hardened-20120607/.catalyst_lock'
Full build log at /tmp/catalyst-auto.29490/log/hardened_stage3.log
^ permalink raw reply [flat|nested] 24+ messages in thread
* [gentoo-releng-autobuilds] [amd64-auto] Catalyst fatal build error - hardened/stage3.spec
@ 2012-06-28 22:49 catalyst
0 siblings, 0 replies; 24+ messages in thread
From: catalyst @ 2012-06-28 22:49 UTC (permalink / raw
To: releng, gentoo-releng-autobuilds
protected: none
omitted: none
sys-devel/automake-wrapper
selected: 7
protected: none
omitted: none
sys-devel/autoconf
selected: 2.68
protected: none
omitted: none
sys-devel/autoconf-wrapper
selected: 12
protected: none
omitted: none
sys-devel/m4
selected: 1.4.16
protected: none
omitted: none
x11-misc/shared-mime-info
selected: 1.0
protected: none
omitted: none
dev-libs/glib
selected: 2.30.3
protected: none
omitted: none
app-admin/perl-cleaner
selected: 2.7
protected: none
omitted: none
dev-lang/perl
selected: 5.12.4-r1
protected: none
omitted: none
sys-devel/libperl
selected: 5.10.1
protected: none
omitted: none
All selected packages: sys-apps/help2man-1.40.8 sys-devel/flex-2.5.35_p10 app-portage/portage-utils-0.10 virtual/yacc-0 sys-devel/m4-1.4.16 dev-util/pkgconfig-0.26 app-admin/perl-cleaner-2.7 dev-util/gtk-doc-am-1.18 sys-devel/autoconf-wrapper-12 sys-devel/libperl-5.10.1 sys-devel/automake-wrapper-7 dev-libs/glib-2.30.3 sys-devel/autoconf-2.68 sys-devel/automake-1.11.1 sys-devel/libtool-2.4-r1 dev-perl/XML-Parser-2.410.0 virtual/pkgconfig-0 dev-lang/perl-5.12.4-r1 sys-devel/bison-2.4.3 dev-util/intltool-0.50.2 sys-apps/makedev-3.23.1 x11-misc/shared-mime-info-1.0 dev-perl/Locale-gettext-1.50.0 dev-util/ccache-3.1.7
>>> 'Selected' packages are slated for removal.
>>> 'Protected' and 'omitted' packages will not be removed.
>>> Unmerging (1 of 24) sys-apps/makedev-3.23.1...
>>> Unmerging (2 of 24) app-portage/portage-utils-0.10...
>>> Unmerging (3 of 24) sys-devel/flex-2.5.35_p10...
>>> Unmerging (4 of 24) virtual/yacc-0...
>>> Unmerging (5 of 24) dev-util/ccache-3.1.7...
>>> Unmerging (6 of 24) sys-devel/bison-2.4.3...
>>> Unmerging (7 of 24) dev-util/intltool-0.50.2...
>>> Unmerging (8 of 24) dev-perl/XML-Parser-2.410.0...
>>> Unmerging (9 of 24) sys-apps/help2man-1.40.8...
>>> Unmerging (10 of 24) dev-perl/Locale-gettext-1.50.0...
>>> Unmerging (11 of 24) dev-util/gtk-doc-am-1.18...
>>> Unmerging (12 of 24) virtual/pkgconfig-0...
>>> Unmerging (13 of 24) dev-util/pkgconfig-0.26...
>>> Unmerging (14 of 24) sys-devel/libtool-2.4-r1...
>>> Unmerging (15 of 24) sys-devel/automake-1.11.1...
>>> Unmerging (16 of 24) sys-devel/automake-wrapper-7...
>>> Unmerging (17 of 24) sys-devel/autoconf-2.68...
>>> Unmerging (18 of 24) sys-devel/autoconf-wrapper-12...
>>> Unmerging (19 of 24) sys-devel/m4-1.4.16...
>>> Unmerging (20 of 24) x11-misc/shared-mime-info-1.0...
>>> Unmerging (21 of 24) dev-libs/glib-2.30.3...
>>> Unmerging (22 of 24) app-admin/perl-cleaner-2.7...
>>> Unmerging (23 of 24) dev-lang/perl-5.12.4-r1...
* Removing dead symlink /usr/bin/ptar
* Removing dead symlink /usr/share/man/man1/ptar.1.bz2
* Removing dead symlink /usr/bin/ptardiff
* Removing dead symlink /usr/share/man/man1/ptardiff.1.bz2
* Removing dead symlink /usr/bin/shasum
* Removing dead symlink /usr/share/man/man1/shasum.1.bz2
* Removing dead symlink /usr/bin/cpan
* Removing dead symlink /usr/share/man/man1/cpan.1.bz2
* Removing dead symlink /usr/bin/cpanp
* Removing dead symlink /usr/share/man/man1/cpanp.1.bz2
* Removing dead symlink /usr/bin/cpan2dist
* Removing dead symlink /usr/share/man/man1/cpan2dist.1.bz2
* Removing dead symlink /usr/bin/cpanp-run-perl
* Removing dead symlink /usr/bin/enc2xs
* Removing dead symlink /usr/share/man/man1/enc2xs.1.bz2
* Removing dead symlink /usr/bin/piconv
* Removing dead symlink /usr/share/man/man1/piconv.1.bz2
* Removing dead symlink /usr/bin/instmodsh
* Removing dead symlink /usr/share/man/man1/instmodsh.1.bz2
* Removing dead symlink /usr/bin/xsubpp
* Removing dead symlink /usr/share/man/man1/xsubpp.1.bz2
* Removing dead symlink /usr/bin/config_data
* Removing dead symlink /usr/share/man/man1/config_data.1.bz2
* Removing dead symlink /usr/bin/corelist
* Removing dead symlink /usr/share/man/man1/corelist.1.bz2
* Removing dead symlink /usr/bin/pod2usage
* Removing dead symlink /usr/share/man/man1/pod2usage.1.bz2
* Removing dead symlink /usr/bin/podchecker
* Removing dead symlink /usr/share/man/man1/podchecker.1.bz2
* Removing dead symlink /usr/bin/podselect
* Removing dead symlink /usr/share/man/man1/podselect.1.bz2
* Removing dead symlink /usr/bin/prove
* Removing dead symlink /usr/share/man/man1/prove.1.bz2
* Removing dead symlink /usr/bin/pod2man
* Removing dead symlink /usr/share/man/man1/pod2man.1.bz2
* Removing dead symlink /usr/bin/pod2text
* Removing dead symlink /usr/share/man/man1/pod2text.1.bz2
>>> Unmerging (24 of 24) sys-devel/libperl-5.10.1...
Packages installed: 97
Packages in world: 0
Packages in system: 43
Required packages: 97
Number removed: 24
* Messages for package dev-lang/perl-5.12.4-r1:
* Removing dead symlink /usr/bin/ptar
* Removing dead symlink /usr/share/man/man1/ptar.1.bz2
* Removing dead symlink /usr/bin/ptardiff
* Removing dead symlink /usr/share/man/man1/ptardiff.1.bz2
* Removing dead symlink /usr/bin/shasum
* Removing dead symlink /usr/share/man/man1/shasum.1.bz2
* Removing dead symlink /usr/bin/cpan
* Removing dead symlink /usr/share/man/man1/cpan.1.bz2
* Removing dead symlink /usr/bin/cpanp
* Removing dead symlink /usr/share/man/man1/cpanp.1.bz2
* Removing dead symlink /usr/bin/cpan2dist
* Removing dead symlink /usr/share/man/man1/cpan2dist.1.bz2
* Removing dead symlink /usr/bin/cpanp-run-perl
* Removing dead symlink /usr/bin/enc2xs
* Removing dead symlink /usr/share/man/man1/enc2xs.1.bz2
* Removing dead symlink /usr/bin/piconv
* Removing dead symlink /usr/share/man/man1/piconv.1.bz2
* Removing dead symlink /usr/bin/instmodsh
* Removing dead symlink /usr/share/man/man1/instmodsh.1.bz2
* Removing dead symlink /usr/bin/xsubpp
* Removing dead symlink /usr/share/man/man1/xsubpp.1.bz2
* Removing dead symlink /usr/bin/config_data
* Removing dead symlink /usr/share/man/man1/config_data.1.bz2
* Removing dead symlink /usr/bin/corelist
* Removing dead symlink /usr/share/man/man1/corelist.1.bz2
* Removing dead symlink /usr/bin/pod2usage
* Removing dead symlink /usr/share/man/man1/pod2usage.1.bz2
* Removing dead symlink /usr/bin/podchecker
* Removing dead symlink /usr/share/man/man1/podchecker.1.bz2
* Removing dead symlink /usr/bin/podselect
* Removing dead symlink /usr/share/man/man1/podselect.1.bz2
* Removing dead symlink /usr/bin/prove
* Removing dead symlink /usr/share/man/man1/prove.1.bz2
* Removing dead symlink /usr/bin/pod2man
* Removing dead symlink /usr/share/man/man1/pod2man.1.bz2
* Removing dead symlink /usr/bin/pod2text
* Removing dead symlink /usr/share/man/man1/pod2text.1.bz2
* Regenerating GNU info directory index...
* Processed 55 info files.
* IMPORTANT: 3 news items need reading for repository 'gentoo'.
* Use eselect news to read news items.
emerge -C dev-util/ccache
!!! CONFIG_PROTECT is empty
* This action can remove important packages! In order to be safer, use
* `emerge -pv --depclean <atom>` to check for reverse dependencies before
* removing packages.
--- Couldn't find 'dev-util/ccache' to unmerge.
>>> No packages selected for removal by unmerge
!!! catalyst: preclean script failed.
Traceback (most recent call last):
File "modules/generic_stage_target.py", line 1167, in preclean
" preclean","preclean script failed.",env=self.env)
File "/usr/lib64/catalyst/modules/catalyst_support.py", line 542, in cmd
raise CatalystError,myexc
CatalystError
None
!!! catalyst: Build failed, could not execute preclean
Traceback (most recent call last):
File "/usr/lib64/catalyst/catalyst", line 209, in build_target
mytarget.run()
File "modules/generic_stage_target.py", line 1263, in run
apply(getattr(self,x))
File "modules/generic_stage_target.py", line 1172, in preclean
raise CatalystError, "Build failed, could not execute preclean"
CatalystError
!!! catalyst: Error encountered during run of target stage3
Catalyst aborting....
lockfile does not exist '/release/buildroot/amd64-dev/tmp/hardened/stage3-amd64-hardened-20120628/.catalyst_lock'
Full build log at /tmp/catalyst-auto.11065/log/hardened_stage3.log
^ permalink raw reply [flat|nested] 24+ messages in thread
* [gentoo-releng-autobuilds] [amd64-auto] Catalyst fatal build error - hardened/stage3.spec
@ 2012-07-05 23:22 catalyst
0 siblings, 0 replies; 24+ messages in thread
From: catalyst @ 2012-07-05 23:22 UTC (permalink / raw
To: releng, gentoo-releng-autobuilds
protected: none
omitted: none
sys-devel/automake-wrapper
selected: 7
protected: none
omitted: none
sys-devel/autoconf
selected: 2.68
protected: none
omitted: none
sys-devel/autoconf-wrapper
selected: 12
protected: none
omitted: none
sys-devel/m4
selected: 1.4.16
protected: none
omitted: none
x11-misc/shared-mime-info
selected: 1.0
protected: none
omitted: none
dev-libs/glib
selected: 2.30.3
protected: none
omitted: none
app-admin/perl-cleaner
selected: 2.7
protected: none
omitted: none
dev-lang/perl
selected: 5.12.4-r1
protected: none
omitted: none
sys-devel/libperl
selected: 5.10.1
protected: none
omitted: none
All selected packages: sys-apps/help2man-1.40.8 sys-devel/flex-2.5.35_p10 app-portage/portage-utils-0.10 virtual/yacc-0 sys-devel/m4-1.4.16 dev-util/pkgconfig-0.26 app-admin/perl-cleaner-2.7 dev-util/gtk-doc-am-1.18 sys-devel/autoconf-wrapper-12 sys-devel/libperl-5.10.1 sys-devel/automake-wrapper-7 dev-libs/glib-2.30.3 sys-devel/autoconf-2.68 sys-devel/automake-1.11.1 sys-devel/libtool-2.4-r1 dev-perl/XML-Parser-2.410.0 virtual/pkgconfig-0 dev-lang/perl-5.12.4-r1 sys-devel/bison-2.4.3 dev-util/intltool-0.50.2 sys-apps/makedev-3.23.1 x11-misc/shared-mime-info-1.0 dev-perl/Locale-gettext-1.50.0 dev-util/ccache-3.1.7
>>> 'Selected' packages are slated for removal.
>>> 'Protected' and 'omitted' packages will not be removed.
>>> Unmerging (1 of 24) sys-apps/makedev-3.23.1...
>>> Unmerging (2 of 24) app-portage/portage-utils-0.10...
>>> Unmerging (3 of 24) sys-devel/flex-2.5.35_p10...
>>> Unmerging (4 of 24) virtual/yacc-0...
>>> Unmerging (5 of 24) dev-util/ccache-3.1.7...
>>> Unmerging (6 of 24) sys-devel/bison-2.4.3...
>>> Unmerging (7 of 24) dev-util/intltool-0.50.2...
>>> Unmerging (8 of 24) dev-perl/XML-Parser-2.410.0...
>>> Unmerging (9 of 24) sys-apps/help2man-1.40.8...
>>> Unmerging (10 of 24) dev-perl/Locale-gettext-1.50.0...
>>> Unmerging (11 of 24) dev-util/gtk-doc-am-1.18...
>>> Unmerging (12 of 24) virtual/pkgconfig-0...
>>> Unmerging (13 of 24) dev-util/pkgconfig-0.26...
>>> Unmerging (14 of 24) sys-devel/libtool-2.4-r1...
>>> Unmerging (15 of 24) sys-devel/automake-1.11.1...
>>> Unmerging (16 of 24) sys-devel/automake-wrapper-7...
>>> Unmerging (17 of 24) sys-devel/autoconf-2.68...
>>> Unmerging (18 of 24) sys-devel/autoconf-wrapper-12...
>>> Unmerging (19 of 24) sys-devel/m4-1.4.16...
>>> Unmerging (20 of 24) x11-misc/shared-mime-info-1.0...
>>> Unmerging (21 of 24) dev-libs/glib-2.30.3...
>>> Unmerging (22 of 24) app-admin/perl-cleaner-2.7...
>>> Unmerging (23 of 24) dev-lang/perl-5.12.4-r1...
* Removing dead symlink /usr/bin/ptar
* Removing dead symlink /usr/share/man/man1/ptar.1.bz2
* Removing dead symlink /usr/bin/ptardiff
* Removing dead symlink /usr/share/man/man1/ptardiff.1.bz2
* Removing dead symlink /usr/bin/shasum
* Removing dead symlink /usr/share/man/man1/shasum.1.bz2
* Removing dead symlink /usr/bin/cpan
* Removing dead symlink /usr/share/man/man1/cpan.1.bz2
* Removing dead symlink /usr/bin/cpanp
* Removing dead symlink /usr/share/man/man1/cpanp.1.bz2
* Removing dead symlink /usr/bin/cpan2dist
* Removing dead symlink /usr/share/man/man1/cpan2dist.1.bz2
* Removing dead symlink /usr/bin/cpanp-run-perl
* Removing dead symlink /usr/bin/enc2xs
* Removing dead symlink /usr/share/man/man1/enc2xs.1.bz2
* Removing dead symlink /usr/bin/piconv
* Removing dead symlink /usr/share/man/man1/piconv.1.bz2
* Removing dead symlink /usr/bin/instmodsh
* Removing dead symlink /usr/share/man/man1/instmodsh.1.bz2
* Removing dead symlink /usr/bin/xsubpp
* Removing dead symlink /usr/share/man/man1/xsubpp.1.bz2
* Removing dead symlink /usr/bin/config_data
* Removing dead symlink /usr/share/man/man1/config_data.1.bz2
* Removing dead symlink /usr/bin/corelist
* Removing dead symlink /usr/share/man/man1/corelist.1.bz2
* Removing dead symlink /usr/bin/pod2usage
* Removing dead symlink /usr/share/man/man1/pod2usage.1.bz2
* Removing dead symlink /usr/bin/podchecker
* Removing dead symlink /usr/share/man/man1/podchecker.1.bz2
* Removing dead symlink /usr/bin/podselect
* Removing dead symlink /usr/share/man/man1/podselect.1.bz2
* Removing dead symlink /usr/bin/prove
* Removing dead symlink /usr/share/man/man1/prove.1.bz2
* Removing dead symlink /usr/bin/pod2man
* Removing dead symlink /usr/share/man/man1/pod2man.1.bz2
* Removing dead symlink /usr/bin/pod2text
* Removing dead symlink /usr/share/man/man1/pod2text.1.bz2
>>> Unmerging (24 of 24) sys-devel/libperl-5.10.1...
Packages installed: 97
Packages in world: 0
Packages in system: 43
Required packages: 97
Number removed: 24
* Messages for package dev-lang/perl-5.12.4-r1:
* Removing dead symlink /usr/bin/ptar
* Removing dead symlink /usr/share/man/man1/ptar.1.bz2
* Removing dead symlink /usr/bin/ptardiff
* Removing dead symlink /usr/share/man/man1/ptardiff.1.bz2
* Removing dead symlink /usr/bin/shasum
* Removing dead symlink /usr/share/man/man1/shasum.1.bz2
* Removing dead symlink /usr/bin/cpan
* Removing dead symlink /usr/share/man/man1/cpan.1.bz2
* Removing dead symlink /usr/bin/cpanp
* Removing dead symlink /usr/share/man/man1/cpanp.1.bz2
* Removing dead symlink /usr/bin/cpan2dist
* Removing dead symlink /usr/share/man/man1/cpan2dist.1.bz2
* Removing dead symlink /usr/bin/cpanp-run-perl
* Removing dead symlink /usr/bin/enc2xs
* Removing dead symlink /usr/share/man/man1/enc2xs.1.bz2
* Removing dead symlink /usr/bin/piconv
* Removing dead symlink /usr/share/man/man1/piconv.1.bz2
* Removing dead symlink /usr/bin/instmodsh
* Removing dead symlink /usr/share/man/man1/instmodsh.1.bz2
* Removing dead symlink /usr/bin/xsubpp
* Removing dead symlink /usr/share/man/man1/xsubpp.1.bz2
* Removing dead symlink /usr/bin/config_data
* Removing dead symlink /usr/share/man/man1/config_data.1.bz2
* Removing dead symlink /usr/bin/corelist
* Removing dead symlink /usr/share/man/man1/corelist.1.bz2
* Removing dead symlink /usr/bin/pod2usage
* Removing dead symlink /usr/share/man/man1/pod2usage.1.bz2
* Removing dead symlink /usr/bin/podchecker
* Removing dead symlink /usr/share/man/man1/podchecker.1.bz2
* Removing dead symlink /usr/bin/podselect
* Removing dead symlink /usr/share/man/man1/podselect.1.bz2
* Removing dead symlink /usr/bin/prove
* Removing dead symlink /usr/share/man/man1/prove.1.bz2
* Removing dead symlink /usr/bin/pod2man
* Removing dead symlink /usr/share/man/man1/pod2man.1.bz2
* Removing dead symlink /usr/bin/pod2text
* Removing dead symlink /usr/share/man/man1/pod2text.1.bz2
* Regenerating GNU info directory index...
* Processed 55 info files.
* IMPORTANT: 3 news items need reading for repository 'gentoo'.
* Use eselect news to read news items.
emerge -C dev-util/ccache
!!! CONFIG_PROTECT is empty
* This action can remove important packages! In order to be safer, use
* `emerge -pv --depclean <atom>` to check for reverse dependencies before
* removing packages.
--- Couldn't find 'dev-util/ccache' to unmerge.
>>> No packages selected for removal by unmerge
!!! catalyst: preclean script failed.
Traceback (most recent call last):
File "modules/generic_stage_target.py", line 1167, in preclean
" preclean","preclean script failed.",env=self.env)
File "/usr/lib64/catalyst/modules/catalyst_support.py", line 542, in cmd
raise CatalystError,myexc
CatalystError
None
!!! catalyst: Build failed, could not execute preclean
Traceback (most recent call last):
File "/usr/lib64/catalyst/catalyst", line 209, in build_target
mytarget.run()
File "modules/generic_stage_target.py", line 1263, in run
apply(getattr(self,x))
File "modules/generic_stage_target.py", line 1172, in preclean
raise CatalystError, "Build failed, could not execute preclean"
CatalystError
!!! catalyst: Error encountered during run of target stage3
Catalyst aborting....
lockfile does not exist '/release/buildroot/amd64-dev/tmp/hardened/stage3-amd64-hardened-20120705/.catalyst_lock'
Full build log at /tmp/catalyst-auto.30277/log/hardened_stage3.log
^ permalink raw reply [flat|nested] 24+ messages in thread
* [gentoo-releng-autobuilds] [amd64-auto] Catalyst fatal build error - hardened/stage3.spec
@ 2012-07-20 15:22 catalyst
0 siblings, 0 replies; 24+ messages in thread
From: catalyst @ 2012-07-20 15:22 UTC (permalink / raw
To: releng, gentoo-releng-autobuilds
* This may however number your devices in a different way than they are now.
*
* If you build an initramfs including udev, then please
* make sure that the /sbin/udevadm binary gets included,
* and your scripts changed to use it,as it replaces the
* old helper apps udevinfo, udevtrigger, ...
*
* mount options for directory /dev are no longer
* set in /etc/udev/udev.conf, but in /etc/fstab
* as for other directories.
*
* If you use /dev/md/*, /dev/loop/* or /dev/rd/*,
* then please migrate over to using the device names
* /dev/md*, /dev/loop* and /dev/ram*.
* The devfs-compat rules have been removed.
* For reference see Bug #269359.
*
* Rules for /dev/hd* devices have been removed
* Please migrate to libata.
*
* For more information on udev on Gentoo, writing udev rules, and
* fixing known issues visit:
* http://www.gentoo.org/doc/en/udev-guide.xml
* Messages for package sys-apps/man-pages-3.40:
* If you don't have a makewhatis cronjob, then you
* should update the whatis database yourself:
* # makewhatis -u
* Messages for package sys-fs/e2fsprogs-1.42:
* No /etc/mtab file, creating one temporarily
* Messages for package sys-libs/pam-1.1.5:
* Some software with pre-loaded PAM libraries might experience
* warnings or failures related to missing symbols and/or versions
* after any update. While unfortunate this is a limit of the
* implementation of PAM and the software, and it requires you to
* restart the software manually after the update.
*
* You can get a list of such software running a command like
* lsof / | egrep -i 'del.*libpam\.so'
*
* Alternatively, simply reboot your system.
* Messages for package sys-auth/pambase-20101024-r2:
* Starting from version 20080801, pambase optionally enables
* SHA512-hashed passwords. For this to work, you need sys-libs/pam-1.0.1
* built against sys-libs/glibc-2.7 or later.
* If you don't have support for this, it will automatically fallback
* to MD5-hashed passwords, just like before.
*
* Please note that the change only affects the newly-changed passwords
* and that SHA512-hashed passwords will not work on earlier versions
* of glibc or Linux-PAM.
* Messages for package sys-apps/openrc-0.9.8.4:
* You should now update all files in /etc, using etc-update
* or equivalent before restarting any services or this host.
*
* Please read the migration guide available at:
* http://www.gentoo.org/doc/en/openrc-migration.xml
* Messages for package sys-apps/busybox-1.20.1:
* Could not locate user configfile, so we will save a default one
* Your configuration for sys-apps/busybox-1.20.1 has been saved in
* /etc/portage/savedconfig/sys-apps/busybox-1.20.1 for your editing pleasure.
* You can edit these files by hand and remerge this package with
* USE=savedconfig to customise the configuration.
* You can rename this file/directory to one of the following for
* its configuration to apply to multiple versions:
* ${PORTAGE_CONFIGROOT}/etc/portage/savedconfig/
* [${CTARGET}|${CHOST}|""]/${CATEGORY}/[${PF}|${P}|${PN}]
* Messages for package net-misc/openssh-5.9_p1-r4:
* Starting with openssh-5.8p1, the server will default to a newer key
* algorithm (ECDSA). You are encouraged to manually update your stored
* keys list as servers update theirs. See ssh-keyscan(1) for more info.
* Remember to merge your config files in /etc/ssh/ and then
* reload sshd: '/etc/init.d/sshd reload'.
* Please be aware users need a valid shell in /etc/passwd
* in order to be allowed to login.
removing /release/buildroot/amd64-dev/tmp/hardened/stage3-amd64-hardened-20120719/tmp/chroot-functions.sh from the chroot
--- Running action sequence: preclean
copying stage3-preclean-chroot.sh to /release/buildroot/amd64-dev/tmp/hardened/stage3-amd64-hardened-20120719/tmp/
copying chroot-functions.sh to /release/buildroot/amd64-dev/tmp/hardened/stage3-amd64-hardened-20120719/tmp/
Running stage3-preclean-chroot.sh in chroot /release/buildroot/amd64-dev/tmp/hardened/stage3-amd64-hardened-20120719/
>>> Regenerating /etc/ld.so.cache...
emerge --depclean --with-bdeps=y
!!! CONFIG_PROTECT is empty
* Depclean may break link level dependencies. Thus, it is
* recommended to use a tool such as `revdep-rebuild` (from
* app-portage/gentoolkit) in order to detect such breakage.
*
* Always study the list of packages to be cleaned for any obvious
* mistakes. Packages that are part of the world set will always
* be kept. They can be manually added to this set with
* `emerge --noreplace <atom>`. Packages that are listed in
* package.provided (see portage(5)) will be removed by
* depclean, even if they are part of the world set.
*
* As a safety measure, depclean will not remove any packages
* unless *all* required dependencies have been resolved. As a
* consequence, it is often necessary to run `emerge --update
* --newuse --deep @world` prior to depclean.
!!! You have no world file.
!!! Proceeding is likely to break your installation.
Calculating dependencies .\b\b... done!
>>> Calculating removal order...
dev-util/ccache
selected: 3.1.7
protected: none
omitted: none
sys-apps/makedev
selected: 3.23.1
protected: none
omitted: none
All selected packages: sys-apps/makedev-3.23.1 dev-util/ccache-3.1.7
>>> 'Selected' packages are slated for removal.
>>> 'Protected' and 'omitted' packages will not be removed.
>>> Unmerging (1 of 2) dev-util/ccache-3.1.7...
>>> Unmerging (2 of 2) sys-apps/makedev-3.23.1...
Packages installed: 119
Packages in world: 0
Packages in system: 43
Required packages: 119
Number removed: 2
* GNU info directory index is up-to-date.
* IMPORTANT: 3 news items need reading for repository 'gentoo'.
* Use eselect news to read news items.
emerge -C dev-util/ccache
!!! CONFIG_PROTECT is empty
* This action can remove important packages! In order to be safer, use
* `emerge -pv --depclean <atom>` to check for reverse dependencies before
* removing packages.
--- Couldn't find 'dev-util/ccache' to unmerge.
>>> No packages selected for removal by unmerge
!!! catalyst: preclean script failed.
Traceback (most recent call last):
File "modules/generic_stage_target.py", line 1154, in preclean
" preclean","preclean script failed.",env=self.env)
File "/usr/lib64/catalyst/modules/catalyst_support.py", line 542, in cmd
raise CatalystError,myexc
CatalystError
None
!!! catalyst: Build failed, could not execute preclean
Traceback (most recent call last):
File "/usr/lib64/catalyst/catalyst", line 206, in build_target
mytarget.run()
File "modules/generic_stage_target.py", line 1254, in run
apply(getattr(self,x))
File "modules/generic_stage_target.py", line 1159, in preclean
raise CatalystError, "Build failed, could not execute preclean"
CatalystError
!!! catalyst: Error encountered during run of target stage3
Catalyst aborting....
lockfile does not exist '/release/buildroot/amd64-dev/tmp/hardened/stage3-amd64-hardened-20120719/.catalyst_lock'
Full build log at /tmp/catalyst-auto.26456/log/hardened_stage3.log
^ permalink raw reply [flat|nested] 24+ messages in thread
* [gentoo-releng-autobuilds] [amd64-auto] Catalyst fatal build error - hardened/stage3.spec
@ 2012-08-10 3:28 catalyst
0 siblings, 0 replies; 24+ messages in thread
From: catalyst @ 2012-08-10 3:28 UTC (permalink / raw
To: releng, gentoo-releng-autobuilds
* This may however number your devices in a different way than they are now.
*
* If you build an initramfs including udev, then please
* make sure that the /sbin/udevadm binary gets included,
* and your scripts changed to use it,as it replaces the
* old helper apps udevinfo, udevtrigger, ...
*
* mount options for directory /dev are no longer
* set in /etc/udev/udev.conf, but in /etc/fstab
* as for other directories.
*
* If you use /dev/md/*, /dev/loop/* or /dev/rd/*,
* then please migrate over to using the device names
* /dev/md*, /dev/loop* and /dev/ram*.
* The devfs-compat rules have been removed.
* For reference see Bug #269359.
*
* Rules for /dev/hd* devices have been removed
* Please migrate to libata.
*
* For more information on udev on Gentoo, writing udev rules, and
* fixing known issues visit:
* http://www.gentoo.org/doc/en/udev-guide.xml
* Messages for package sys-apps/man-pages-3.40:
* If you don't have a makewhatis cronjob, then you
* should update the whatis database yourself:
* # makewhatis -u
* Messages for package sys-fs/e2fsprogs-1.42:
* No /etc/mtab file, creating one temporarily
* Messages for package sys-libs/pam-1.1.5:
* Some software with pre-loaded PAM libraries might experience
* warnings or failures related to missing symbols and/or versions
* after any update. While unfortunate this is a limit of the
* implementation of PAM and the software, and it requires you to
* restart the software manually after the update.
*
* You can get a list of such software running a command like
* lsof / | egrep -i 'del.*libpam\.so'
*
* Alternatively, simply reboot your system.
* Messages for package sys-auth/pambase-20101024-r2:
* Starting from version 20080801, pambase optionally enables
* SHA512-hashed passwords. For this to work, you need sys-libs/pam-1.0.1
* built against sys-libs/glibc-2.7 or later.
* If you don't have support for this, it will automatically fallback
* to MD5-hashed passwords, just like before.
*
* Please note that the change only affects the newly-changed passwords
* and that SHA512-hashed passwords will not work on earlier versions
* of glibc or Linux-PAM.
* Messages for package sys-apps/openrc-0.9.8.4:
* You should now update all files in /etc, using etc-update
* or equivalent before restarting any services or this host.
*
* Please read the migration guide available at:
* http://www.gentoo.org/doc/en/openrc-migration.xml
* Messages for package sys-apps/busybox-1.20.1:
* Could not locate user configfile, so we will save a default one
* Your configuration for sys-apps/busybox-1.20.1 has been saved in
* /etc/portage/savedconfig/sys-apps/busybox-1.20.1 for your editing pleasure.
* You can edit these files by hand and remerge this package with
* USE=savedconfig to customise the configuration.
* You can rename this file/directory to one of the following for
* its configuration to apply to multiple versions:
* ${PORTAGE_CONFIGROOT}/etc/portage/savedconfig/
* [${CTARGET}|${CHOST}|""]/${CATEGORY}/[${PF}|${P}|${PN}]
* Messages for package net-misc/openssh-5.9_p1-r4:
* Starting with openssh-5.8p1, the server will default to a newer key
* algorithm (ECDSA). You are encouraged to manually update your stored
* keys list as servers update theirs. See ssh-keyscan(1) for more info.
* Remember to merge your config files in /etc/ssh/ and then
* reload sshd: '/etc/init.d/sshd reload'.
* Please be aware users need a valid shell in /etc/passwd
* in order to be allowed to login.
removing /release/buildroot/amd64-dev/tmp/hardened/stage3-amd64-hardened-20120809/tmp/chroot-functions.sh from the chroot
--- Running action sequence: preclean
copying stage3-preclean-chroot.sh to /release/buildroot/amd64-dev/tmp/hardened/stage3-amd64-hardened-20120809/tmp/
copying chroot-functions.sh to /release/buildroot/amd64-dev/tmp/hardened/stage3-amd64-hardened-20120809/tmp/
Running stage3-preclean-chroot.sh in chroot /release/buildroot/amd64-dev/tmp/hardened/stage3-amd64-hardened-20120809/
>>> Regenerating /etc/ld.so.cache...
emerge --depclean --with-bdeps=y
!!! CONFIG_PROTECT is empty
* Depclean may break link level dependencies. Thus, it is
* recommended to use a tool such as `revdep-rebuild` (from
* app-portage/gentoolkit) in order to detect such breakage.
*
* Always study the list of packages to be cleaned for any obvious
* mistakes. Packages that are part of the world set will always
* be kept. They can be manually added to this set with
* `emerge --noreplace <atom>`. Packages that are listed in
* package.provided (see portage(5)) will be removed by
* depclean, even if they are part of the world set.
*
* As a safety measure, depclean will not remove any packages
* unless *all* required dependencies have been resolved. As a
* consequence, it is often necessary to run `emerge --update
* --newuse --deep @world` prior to depclean.
!!! You have no world file.
!!! Proceeding is likely to break your installation.
Calculating dependencies \b\b... done!
>>> Calculating removal order...
dev-util/ccache
selected: 3.1.7
protected: none
omitted: none
sys-apps/makedev
selected: 3.23.1
protected: none
omitted: none
All selected packages: sys-apps/makedev-3.23.1 dev-util/ccache-3.1.7
>>> 'Selected' packages are slated for removal.
>>> 'Protected' and 'omitted' packages will not be removed.
>>> Unmerging (1 of 2) dev-util/ccache-3.1.7...
>>> Unmerging (2 of 2) sys-apps/makedev-3.23.1...
Packages installed: 119
Packages in world: 0
Packages in system: 43
Required packages: 119
Number removed: 2
* GNU info directory index is up-to-date.
* IMPORTANT: 3 news items need reading for repository 'gentoo'.
* Use eselect news to read news items.
emerge -C dev-util/ccache
!!! CONFIG_PROTECT is empty
* This action can remove important packages! In order to be safer, use
* `emerge -pv --depclean <atom>` to check for reverse dependencies before
* removing packages.
--- Couldn't find 'dev-util/ccache' to unmerge.
>>> No packages selected for removal by unmerge
!!! catalyst: preclean script failed.
Traceback (most recent call last):
File "modules/generic_stage_target.py", line 1154, in preclean
" preclean","preclean script failed.",env=self.env)
File "/usr/lib64/catalyst/modules/catalyst_support.py", line 542, in cmd
raise CatalystError,myexc
CatalystError
None
!!! catalyst: Build failed, could not execute preclean
Traceback (most recent call last):
File "/usr/lib64/catalyst/catalyst", line 206, in build_target
mytarget.run()
File "modules/generic_stage_target.py", line 1254, in run
apply(getattr(self,x))
File "modules/generic_stage_target.py", line 1159, in preclean
raise CatalystError, "Build failed, could not execute preclean"
CatalystError
!!! catalyst: Error encountered during run of target stage3
Catalyst aborting....
lockfile does not exist '/release/buildroot/amd64-dev/tmp/hardened/stage3-amd64-hardened-20120809/.catalyst_lock'
Full build log at /tmp/catalyst-auto.5808/log/hardened_stage3.log
^ permalink raw reply [flat|nested] 24+ messages in thread
* [gentoo-releng-autobuilds] [amd64-auto] Catalyst fatal build error - hardened/stage3.spec
@ 2012-08-16 22:56 catalyst
0 siblings, 0 replies; 24+ messages in thread
From: catalyst @ 2012-08-16 22:56 UTC (permalink / raw
To: releng, gentoo-releng-autobuilds
* This may however number your devices in a different way than they are now.
*
* If you build an initramfs including udev, then please
* make sure that the /sbin/udevadm binary gets included,
* and your scripts changed to use it,as it replaces the
* old helper apps udevinfo, udevtrigger, ...
*
* mount options for directory /dev are no longer
* set in /etc/udev/udev.conf, but in /etc/fstab
* as for other directories.
*
* If you use /dev/md/*, /dev/loop/* or /dev/rd/*,
* then please migrate over to using the device names
* /dev/md*, /dev/loop* and /dev/ram*.
* The devfs-compat rules have been removed.
* For reference see Bug #269359.
*
* Rules for /dev/hd* devices have been removed
* Please migrate to libata.
*
* For more information on udev on Gentoo, writing udev rules, and
* fixing known issues visit:
* http://www.gentoo.org/doc/en/udev-guide.xml
* Messages for package sys-apps/man-pages-3.40:
* If you don't have a makewhatis cronjob, then you
* should update the whatis database yourself:
* # makewhatis -u
* Messages for package sys-fs/e2fsprogs-1.42:
* No /etc/mtab file, creating one temporarily
* Messages for package sys-libs/pam-1.1.5:
* Some software with pre-loaded PAM libraries might experience
* warnings or failures related to missing symbols and/or versions
* after any update. While unfortunate this is a limit of the
* implementation of PAM and the software, and it requires you to
* restart the software manually after the update.
*
* You can get a list of such software running a command like
* lsof / | egrep -i 'del.*libpam\.so'
*
* Alternatively, simply reboot your system.
* Messages for package sys-auth/pambase-20101024-r2:
* Starting from version 20080801, pambase optionally enables
* SHA512-hashed passwords. For this to work, you need sys-libs/pam-1.0.1
* built against sys-libs/glibc-2.7 or later.
* If you don't have support for this, it will automatically fallback
* to MD5-hashed passwords, just like before.
*
* Please note that the change only affects the newly-changed passwords
* and that SHA512-hashed passwords will not work on earlier versions
* of glibc or Linux-PAM.
* Messages for package sys-apps/openrc-0.9.8.4:
* You should now update all files in /etc, using etc-update
* or equivalent before restarting any services or this host.
*
* Please read the migration guide available at:
* http://www.gentoo.org/doc/en/openrc-migration.xml
* Messages for package sys-apps/busybox-1.20.1:
* Could not locate user configfile, so we will save a default one
* Your configuration for sys-apps/busybox-1.20.1 has been saved in
* /etc/portage/savedconfig/sys-apps/busybox-1.20.1 for your editing pleasure.
* You can edit these files by hand and remerge this package with
* USE=savedconfig to customise the configuration.
* You can rename this file/directory to one of the following for
* its configuration to apply to multiple versions:
* ${PORTAGE_CONFIGROOT}/etc/portage/savedconfig/
* [${CTARGET}|${CHOST}|""]/${CATEGORY}/[${PF}|${P}|${PN}]
* Messages for package net-misc/openssh-5.9_p1-r4:
* Starting with openssh-5.8p1, the server will default to a newer key
* algorithm (ECDSA). You are encouraged to manually update your stored
* keys list as servers update theirs. See ssh-keyscan(1) for more info.
* Remember to merge your config files in /etc/ssh/ and then
* reload sshd: '/etc/init.d/sshd reload'.
* Please be aware users need a valid shell in /etc/passwd
* in order to be allowed to login.
removing /release/buildroot/amd64-dev/tmp/hardened/stage3-amd64-hardened-20120816/tmp/chroot-functions.sh from the chroot
--- Running action sequence: preclean
copying stage3-preclean-chroot.sh to /release/buildroot/amd64-dev/tmp/hardened/stage3-amd64-hardened-20120816/tmp/
copying chroot-functions.sh to /release/buildroot/amd64-dev/tmp/hardened/stage3-amd64-hardened-20120816/tmp/
Running stage3-preclean-chroot.sh in chroot /release/buildroot/amd64-dev/tmp/hardened/stage3-amd64-hardened-20120816/
>>> Regenerating /etc/ld.so.cache...
emerge --depclean --with-bdeps=y
!!! CONFIG_PROTECT is empty
* Depclean may break link level dependencies. Thus, it is
* recommended to use a tool such as `revdep-rebuild` (from
* app-portage/gentoolkit) in order to detect such breakage.
*
* Always study the list of packages to be cleaned for any obvious
* mistakes. Packages that are part of the world set will always
* be kept. They can be manually added to this set with
* `emerge --noreplace <atom>`. Packages that are listed in
* package.provided (see portage(5)) will be removed by
* depclean, even if they are part of the world set.
*
* As a safety measure, depclean will not remove any packages
* unless *all* required dependencies have been resolved. As a
* consequence, it is often necessary to run `emerge --update
* --newuse --deep @world` prior to depclean.
!!! You have no world file.
!!! Proceeding is likely to break your installation.
Calculating dependencies .\b\b... done!
>>> Calculating removal order...
dev-util/ccache
selected: 3.1.7
protected: none
omitted: none
sys-apps/makedev
selected: 3.23.1
protected: none
omitted: none
All selected packages: sys-apps/makedev-3.23.1 dev-util/ccache-3.1.7
>>> 'Selected' packages are slated for removal.
>>> 'Protected' and 'omitted' packages will not be removed.
>>> Unmerging (1 of 2) dev-util/ccache-3.1.7...
>>> Unmerging (2 of 2) sys-apps/makedev-3.23.1...
Packages installed: 119
Packages in world: 0
Packages in system: 43
Required packages: 119
Number removed: 2
* GNU info directory index is up-to-date.
* IMPORTANT: 3 news items need reading for repository 'gentoo'.
* Use eselect news to read news items.
emerge -C dev-util/ccache
!!! CONFIG_PROTECT is empty
* This action can remove important packages! In order to be safer, use
* `emerge -pv --depclean <atom>` to check for reverse dependencies before
* removing packages.
--- Couldn't find 'dev-util/ccache' to unmerge.
>>> No packages selected for removal by unmerge
!!! catalyst: preclean script failed.
Traceback (most recent call last):
File "modules/generic_stage_target.py", line 1154, in preclean
" preclean","preclean script failed.",env=self.env)
File "/usr/lib64/catalyst/modules/catalyst_support.py", line 542, in cmd
raise CatalystError,myexc
CatalystError
None
!!! catalyst: Build failed, could not execute preclean
Traceback (most recent call last):
File "/usr/lib64/catalyst/catalyst", line 206, in build_target
mytarget.run()
File "modules/generic_stage_target.py", line 1254, in run
apply(getattr(self,x))
File "modules/generic_stage_target.py", line 1159, in preclean
raise CatalystError, "Build failed, could not execute preclean"
CatalystError
!!! catalyst: Error encountered during run of target stage3
Catalyst aborting....
lockfile does not exist '/release/buildroot/amd64-dev/tmp/hardened/stage3-amd64-hardened-20120816/.catalyst_lock'
Full build log at /tmp/catalyst-auto.10193/log/hardened_stage3.log
^ permalink raw reply [flat|nested] 24+ messages in thread
* [gentoo-releng-autobuilds] [amd64-auto] Catalyst fatal build error - hardened/stage3.spec
@ 2012-08-23 20:19 catalyst
0 siblings, 0 replies; 24+ messages in thread
From: catalyst @ 2012-08-23 20:19 UTC (permalink / raw
To: releng, gentoo-releng-autobuilds
-DSTANDARD_STARTFILE_PREFIX=\"../../../\" -DSTANDARD_EXEC_PREFIX=\"/usr/lib/gcc/\" -DSTANDARD_LIBEXEC_PREFIX=\"/usr/libexec/gcc/\" -DDEFAULT_TARGET_VERSION=\"4.5.4\" -DDEFAULT_TARGET_MACHINE=\"x86_64-pc-linux-gnu\" -DSTANDARD_BINDIR_PREFIX=\"/usr/x86_64-pc-linux-gnu/gcc-bin/4.5.4/\" -DTOOLDIR_BASE_PREFIX=\"../../../../\" `test "X${SHLIB_LINK}" = "X" || test "yes" != "yes" || echo "-DENABLE_SHARED_LIBGCC"` -DCONFIGURE_SPECS="\"\"" \
-c /var/tmp/portage/sys-devel/gcc-4.5.4/work/gcc-4.5.4/gcc/gccspec.c -o gccspec.o)
/var/tmp/portage/sys-devel/gcc-4.5.4/work/build/./prev-gcc/xgcc -B/var/tmp/portage/sys-devel/gcc-4.5.4/work/build/./prev-gcc/ -B/usr/x86_64-pc-linux-gnu/bin/ -B/usr/x86_64-pc-linux-gnu/bin/ -B/usr/x86_64-pc-linux-gnu/lib/ -isystem /usr/x86_64-pc-linux-gnu/include -isystem /usr/x86_64-pc-linux-gnu/sys-include -c -DEFAULT_RELRO -DEFAULT_BIND_NOW -DEFAULT_PIE_SSP -fno-PIE -m64 -O2 -pipe -gtoggle -DIN_GCC -W -Wall -Wwrite-strings -Wcast-qual -Wstrict-prototypes -Wmissing-prototypes -Wmissing-format-attribute -pedantic -Wno-long-long -Wno-variadic-macros -Wno-overlength-strings -Wold-style-definition -Wc++-compat -DHAVE_CONFIG_H -I. -I. -I/var/tmp/portage/sys-devel/gcc-4.5.4/work/gcc-4.5.4/gcc -I/var/tmp/portage/sys-devel/gcc-4.5.4/work/gcc-4.5.4/gcc/. -I/var/tmp/portage/sys-devel/gcc-4.5.4/work/gcc-4.5.4/gcc/../include -I/var/tmp/portage/sys-devel/gcc-4.5.4/work/gcc-4.5.4/gcc/../libcpp/include -I/var/tmp/portage/sys-devel/gcc-4.5.4/work/gcc-4.5.4/gcc/../libdecnumber -
I/var/tmp/portage/sys-devel/gcc-4.5.4/work/gcc-4.5.4/gcc/../libdecnumber/bid -I../libdecnumber -I. -I. -I/var/tmp/portage/sys-devel/gcc-4.5.4/work/gcc-4.5.4/gcc -I/var/tmp/portage/sys-devel/gcc-4.5.4/work/gcc-4.5.4/gcc/. -I/var/tmp/portage/sys-devel/gcc-4.5.4/work/gcc-4.5.4/gcc/../include -I/var/tmp/portage/sys-devel/gcc-4.5.4/work/gcc-4.5.4/gcc/../libcpp/include -I/var/tmp/portage/sys-devel/gcc-4.5.4/work/gcc-4.5.4/gcc/../libdecnumber -I/var/tmp/portage/sys-devel/gcc-4.5.4/work/gcc-4.5.4/gcc/../libdecnumber/bid -I../libdecnumber /var/tmp/portage/sys-devel/gcc-4.5.4/work/gcc-4.5.4/gcc/config/i386/driver-i386.c
/var/tmp/portage/sys-devel/gcc-4.5.4/work/build/./prev-gcc/xgcc -B/var/tmp/portage/sys-devel/gcc-4.5.4/work/build/./prev-gcc/ -B/usr/x86_64-pc-linux-gnu/bin/ -B/usr/x86_64-pc-linux-gnu/bin/ -B/usr/x86_64-pc-linux-gnu/lib/ -isystem /usr/x86_64-pc-linux-gnu/include -isystem /usr/x86_64-pc-linux-gnu/sys-include -c -DEFAULT_RELRO -DEFAULT_BIND_NOW -DEFAULT_PIE_SSP -fno-PIE -m64 -O2 -pipe -gtoggle -DIN_GCC -W -Wall -Wwrite-strings -Wcast-qual -Wstrict-prototypes -Wmissing-prototypes -Wmissing-format-attribute -pedantic -Wno-long-long -Wno-variadic-macros -Wno-overlength-strings -Wold-style-definition -Wc++-compat -DHAVE_CONFIG_H -I. -I. -I/var/tmp/portage/sys-devel/gcc-4.5.4/work/gcc-4.5.4/gcc -I/var/tmp/portage/sys-devel/gcc-4.5.4/work/gcc-4.5.4/gcc/. -I/var/tmp/portage/sys-devel/gcc-4.5.4/work/gcc-4.5.4/gcc/../include -I/var/tmp/portage/sys-devel/gcc-4.5.4/work/gcc-4.5.4/gcc/../libcpp/include -I/var/tmp/portage/sys-devel/gcc-4.5.4/work/gcc-4.5.4/gcc/../libdecnumber -
I/var/tmp/portage/sys-devel/gcc-4.5.4/work/gcc-4.5.4/gcc/../libdecnumber/bid -I../libdecnumber /var/tmp/portage/sys-devel/gcc-4.5.4/work/gcc-4.5.4/gcc/cppspec.c -o cppspec.o
/var/tmp/portage/sys-devel/gcc-4.5.4/work/build/./prev-gcc/xgcc -B/var/tmp/portage/sys-devel/gcc-4.5.4/work/build/./prev-gcc/ -B/usr/x86_64-pc-linux-gnu/bin/ -B/usr/x86_64-pc-linux-gnu/bin/ -B/usr/x86_64-pc-linux-gnu/lib/ -isystem /usr/x86_64-pc-linux-gnu/include -isystem /usr/x86_64-pc-linux-gnu/sys-include -DEFAULT_RELRO -DEFAULT_BIND_NOW -DEFAULT_PIE_SSP -fno-PIE -m64 -O2 -pipe -gtoggle -DIN_GCC -W -Wall -Wwrite-strings -Wcast-qual -Wstrict-prototypes -Wmissing-prototypes -Wmissing-format-attribute -pedantic -Wno-long-long -Wno-variadic-macros -Wno-overlength-strings -Wold-style-definition -Wc++-compat -DHAVE_CONFIG_H gcov.o intl.o version.o errors.o ../libcpp/libcpp.a ../libiberty/libiberty.a ../libdecnumber/libdecnumber.a -o gcov
/var/tmp/portage/sys-devel/gcc-4.5.4/work/build/./prev-gcc/xgcc -B/var/tmp/portage/sys-devel/gcc-4.5.4/work/build/./prev-gcc/ -B/usr/x86_64-pc-linux-gnu/bin/ -B/usr/x86_64-pc-linux-gnu/bin/ -B/usr/x86_64-pc-linux-gnu/lib/ -isystem /usr/x86_64-pc-linux-gnu/include -isystem /usr/x86_64-pc-linux-gnu/sys-include -DEFAULT_RELRO -DEFAULT_BIND_NOW -DEFAULT_PIE_SSP -fno-PIE -m64 -O2 -pipe -gtoggle -DIN_GCC -W -Wall -Wwrite-strings -Wcast-qual -Wstrict-prototypes -Wmissing-prototypes -Wmissing-format-attribute -pedantic -Wno-long-long -Wno-variadic-macros -Wno-overlength-strings -Wold-style-definition -Wc++-compat -DHAVE_CONFIG_H gcov-dump.o version.o errors.o \
../libcpp/libcpp.a ../libiberty/libiberty.a ../libdecnumber/libdecnumber.a -o gcov-dump
/var/tmp/portage/sys-devel/gcc-4.5.4/work/build/./prev-gcc/xgcc -B/var/tmp/portage/sys-devel/gcc-4.5.4/work/build/./prev-gcc/ -B/usr/x86_64-pc-linux-gnu/bin/ -B/usr/x86_64-pc-linux-gnu/bin/ -B/usr/x86_64-pc-linux-gnu/lib/ -isystem /usr/x86_64-pc-linux-gnu/include -isystem /usr/x86_64-pc-linux-gnu/sys-include -DEFAULT_RELRO -DEFAULT_BIND_NOW -DEFAULT_PIE_SSP -fno-PIE -m64 -O2 -pipe -gtoggle -DIN_GCC -W -Wall -Wwrite-strings -Wcast-qual -Wstrict-prototypes -Wmissing-prototypes -Wmissing-format-attribute -pedantic -Wno-long-long -Wno-variadic-macros -Wno-overlength-strings -Wold-style-definition -Wc++-compat -DHAVE_CONFIG_H -o Tcollect2 \
collect2.o collect2-aix.o tlink.o intl.o version.o ../libcpp/libcpp.a ../libiberty/libiberty.a ../libdecnumber/libdecnumber.a
/var/tmp/portage/sys-devel/gcc-4.5.4/work/build/./prev-gcc/xgcc -B/var/tmp/portage/sys-devel/gcc-4.5.4/work/build/./prev-gcc/ -B/usr/x86_64-pc-linux-gnu/bin/ -B/usr/x86_64-pc-linux-gnu/bin/ -B/usr/x86_64-pc-linux-gnu/lib/ -isystem /usr/x86_64-pc-linux-gnu/include -isystem /usr/x86_64-pc-linux-gnu/sys-include -c -DEFAULT_RELRO -DEFAULT_BIND_NOW -DEFAULT_PIE_SSP -fno-PIE -m64 -O2 -pipe -gtoggle -DIN_GCC -W -Wall -Wwrite-strings -Wcast-qual -Wstrict-prototypes -Wmissing-prototypes -Wmissing-format-attribute -pedantic -Wno-long-long -Wno-variadic-macros -Wno-overlength-strings -Wold-style-definition -Wc++-compat -DHAVE_CONFIG_H -I. -I. -I/var/tmp/portage/sys-devel/gcc-4.5.4/work/gcc-4.5.4/gcc -I/var/tmp/portage/sys-devel/gcc-4.5.4/work/gcc-4.5.4/gcc/. -I/var/tmp/portage/sys-devel/gcc-4.5.4/work/gcc-4.5.4/gcc/../include -I/var/tmp/portage/sys-devel/gcc-4.5.4/work/gcc-4.5.4/gcc/../libcpp/include -I/var/tmp/portage/sys-devel/gcc-4.5.4/work/gcc-4.5.4/gcc/../libdecnumber -
I/var/tmp/portage/sys-devel/gcc-4.5.4/work/gcc-4.5.4/gcc/../libdecnumber/bid -I../libdecnumber insn-attrtab.c -o insn-attrtab.o
mv -f Tcollect2 collect2
/var/tmp/portage/sys-devel/gcc-4.5.4/work/build/./prev-gcc/xgcc -B/var/tmp/portage/sys-devel/gcc-4.5.4/work/build/./prev-gcc/ -B/usr/x86_64-pc-linux-gnu/bin/ -B/usr/x86_64-pc-linux-gnu/bin/ -B/usr/x86_64-pc-linux-gnu/lib/ -isystem /usr/x86_64-pc-linux-gnu/include -isystem /usr/x86_64-pc-linux-gnu/sys-include -DEFAULT_RELRO -DEFAULT_BIND_NOW -DEFAULT_PIE_SSP -fno-PIE -m64 -O2 -pipe -gtoggle -DIN_GCC -W -Wall -Wwrite-strings -Wcast-qual -Wstrict-prototypes -Wmissing-prototypes -Wmissing-format-attribute -pedantic -Wno-long-long -Wno-variadic-macros -Wno-overlength-strings -Wold-style-definition -Wc++-compat -DHAVE_CONFIG_H -o xgcc gcc.o opts-common.o gcc-options.o \
gccspec.o intl.o prefix.o version.o driver-i386.o ../libcpp/libcpp.a ../libiberty/libiberty.a ../libdecnumber/libdecnumber.a
/var/tmp/portage/sys-devel/gcc-4.5.4/work/build/./prev-gcc/xgcc -B/var/tmp/portage/sys-devel/gcc-4.5.4/work/build/./prev-gcc/ -B/usr/x86_64-pc-linux-gnu/bin/ -B/usr/x86_64-pc-linux-gnu/bin/ -B/usr/x86_64-pc-linux-gnu/lib/ -isystem /usr/x86_64-pc-linux-gnu/include -isystem /usr/x86_64-pc-linux-gnu/sys-include -DEFAULT_RELRO -DEFAULT_BIND_NOW -DEFAULT_PIE_SSP -fno-PIE -m64 -O2 -pipe -gtoggle -DIN_GCC -W -Wall -Wwrite-strings -Wcast-qual -Wstrict-prototypes -Wmissing-prototypes -Wmissing-format-attribute -pedantic -Wno-long-long -Wno-variadic-macros -Wno-overlength-strings -Wold-style-definition -Wc++-compat -DHAVE_CONFIG_H -o cpp gcc.o opts-common.o gcc-options.o \
cppspec.o intl.o prefix.o version.o driver-i386.o ../libcpp/libcpp.a ../libiberty/libiberty.a ../libdecnumber/libdecnumber.a
/var/tmp/portage/sys-devel/gcc-4.5.4/work/build/./prev-gcc/xgcc -B/var/tmp/portage/sys-devel/gcc-4.5.4/work/build/./prev-gcc/ -B/usr/x86_64-pc-linux-gnu/bin/ -B/usr/x86_64-pc-linux-gnu/bin/ -B/usr/x86_64-pc-linux-gnu/lib/ -isystem /usr/x86_64-pc-linux-gnu/include -isystem /usr/x86_64-pc-linux-gnu/sys-include -DEFAULT_RELRO -DEFAULT_BIND_NOW -DEFAULT_PIE_SSP -fno-PIE -m64 -O2 -pipe -gtoggle -DIN_GCC -W -Wall -Wwrite-strings -Wcast-qual -Wstrict-prototypes -Wmissing-prototypes -Wmissing-format-attribute -pedantic -Wno-long-long -Wno-variadic-macros -Wno-overlength-strings -Wold-style-definition -Wc++-compat -DHAVE_CONFIG_H -o g++ \
gcc.o opts-common.o gcc-options.o g++spec.o intl.o prefix.o version.o driver-i386.o ../libcpp/libcpp.a ../libiberty/libiberty.a ../libdecnumber/libdecnumber.a
/var/tmp/portage/sys-devel/gcc-4.5.4/work/build/./gcc/xgcc -B/var/tmp/portage/sys-devel/gcc-4.5.4/work/build/./gcc/ -dumpspecs > tmp-specs
mv tmp-specs specs
: > tmp-libgcc.mvars
echo LIB1ASMFUNCS = '' >> tmp-libgcc.mvars
echo LIB1ASMSRC = '' >> tmp-libgcc.mvars
echo LIB2FUNCS_ST = '_eprintf __gcc_bcmp' >> tmp-libgcc.mvars
echo LIB2FUNCS_EXCLUDE = ' _fixtfsi _fixunstfsi _floatsitf _floatunsitf _fixtfdi _fixunstfdi _floatditf _floatunditf' >> tmp-libgcc.mvars
echo LIBGCOV = '_gcov _gcov_merge_add _gcov_merge_single _gcov_merge_delta _gcov_fork _gcov_execl _gcov_execlp _gcov_execle _gcov_execv _gcov_execvp _gcov_execve _gcov_interval_profiler _gcov_pow2_profiler _gcov_one_value_profiler _gcov_indirect_call_profiler _gcov_average_profiler _gcov_ior_profiler _gcov_merge_ior' >> tmp-libgcc.mvars
echo LIB2ADD = '$(gcc_srcdir)/config/soft-fp/addtf3.c $(gcc_srcdir)/config/soft-fp/divtf3.c $(gcc_srcdir)/config/soft-fp/eqtf2.c $(gcc_srcdir)/config/soft-fp/getf2.c $(gcc_srcdir)/config/soft-fp/letf2.c $(gcc_srcdir)/config/soft-fp/multf3.c $(gcc_srcdir)/config/soft-fp/negtf2.c $(gcc_srcdir)/config/soft-fp/subtf3.c $(gcc_srcdir)/config/soft-fp/unordtf2.c $(gcc_srcdir)/config/soft-fp/fixtfsi.c $(gcc_srcdir)/config/soft-fp/fixunstfsi.c $(gcc_srcdir)/config/soft-fp/floatsitf.c $(gcc_srcdir)/config/soft-fp/floatunsitf.c $(gcc_srcdir)/config/soft-fp/fixtfdi.c $(gcc_srcdir)/config/soft-fp/fixunstfdi.c $(gcc_srcdir)/config/soft-fp/floatditf.c $(gcc_srcdir)/config/soft-fp/floatunditf.c $(gcc_srcdir)/config/soft-fp/fixtfti.c $(gcc_srcdir)/config/soft-fp/fixunstfti.c $(gcc_srcdir)/config/soft-fp/floattitf.c $(gcc_srcdir)/config/soft-fp/floatuntitf.c $(gcc_srcdir)/config/soft-fp/extendsftf2.c $(gcc_srcdir)/config/soft-fp/extenddftf2.c $(gcc_srcdir)/config/soft-fp/extendxftf2.c $(gcc_src
dir)/config/soft-fp/trunctfsf2.c $(gcc_srcdir)/config/soft-fp/trunctfdf2.c $(gcc_srcdir)/config/soft-fp/trunctfxf2.c ' >> tmp-libgcc.mvars
echo LIB2ADD_ST = ' ' >> tmp-libgcc.mvars
echo LIB2ADDEH = '$(gcc_srcdir)/unwind-dw2.c $(gcc_srcdir)/unwind-dw2-fde-glibc.c $(gcc_srcdir)/unwind-sjlj.c $(gcc_srcdir)/gthr-gnat.c $(gcc_srcdir)/unwind-c.c $(gcc_srcdir)/emutls.c ' >> tmp-libgcc.mvars
echo LIB2ADDEHSTATIC = '$(gcc_srcdir)/unwind-dw2.c $(gcc_srcdir)/unwind-dw2-fde-glibc.c $(gcc_srcdir)/unwind-sjlj.c $(gcc_srcdir)/gthr-gnat.c $(gcc_srcdir)/unwind-c.c $(gcc_srcdir)/emutls.c ' >> tmp-libgcc.mvars
echo LIB2ADDEHSHARED = '$(gcc_srcdir)/unwind-dw2.c $(gcc_srcdir)/unwind-dw2-fde-glibc.c $(gcc_srcdir)/unwind-sjlj.c $(gcc_srcdir)/gthr-gnat.c $(gcc_srcdir)/unwind-c.c $(gcc_srcdir)/emutls.c ' >> tmp-libgcc.mvars
echo LIB2_SIDITI_CONV_FUNCS = '' >> tmp-libgcc.mvars
echo LIBUNWIND = ' ' >> tmp-libgcc.mvars
echo SHLIBUNWIND_LINK = '' >> tmp-libgcc.mvars
echo SHLIBUNWIND_INSTALL = '' >> tmp-libgcc.mvars
echo FPBIT = '' >> tmp-libgcc.mvars
echo FPBIT_FUNCS = '_pack_sf _unpack_sf _addsub_sf _mul_sf _div_sf _fpcmp_parts_sf _compare_sf _eq_sf _ne_sf _gt_sf _ge_sf _lt_sf _le_sf _unord_sf _si_to_sf _sf_to_si _negate_sf _make_sf _sf_to_df _sf_to_tf _thenan_sf _sf_to_usi _usi_to_sf' >> tmp-libgcc.mvars
echo LIB2_DIVMOD_FUNCS = '_divdi3 _moddi3 _udivdi3 _umoddi3 _udiv_w_sdiv _udivmoddi4' >> tmp-libgcc.mvars
echo DPBIT = '' >> tmp-libgcc.mvars
echo DPBIT_FUNCS = '_pack_df _unpack_df _addsub_df _mul_df _div_df _fpcmp_parts_df _compare_df _eq_df _ne_df _gt_df _ge_df _lt_df _le_df _unord_df _si_to_df _df_to_si _negate_df _make_df _df_to_sf _df_to_tf _thenan_df _df_to_usi _usi_to_df' >> tmp-libgcc.mvars
echo TPBIT = '' >> tmp-libgcc.mvars
echo TPBIT_FUNCS = '_pack_tf _unpack_tf _addsub_tf _mul_tf _div_tf _fpcmp_parts_tf _compare_tf _eq_tf _ne_tf _gt_tf _ge_tf _lt_tf _le_tf _unord_tf _si_to_tf _tf_to_si _negate_tf _make_tf _tf_to_df _tf_to_sf _thenan_tf _tf_to_usi _usi_to_tf' >> tmp-libgcc.mvars
echo DFP_ENABLE = 'true' >> tmp-libgcc.mvars
echo DFP_CFLAGS='' >> tmp-libgcc.mvars
echo D32PBIT='' >> tmp-libgcc.mvars
echo D32PBIT_FUNCS='_addsub_sd _div_sd _mul_sd _plus_sd _minus_sd _eq_sd _ne_sd _lt_sd _gt_sd _le_sd _ge_sd _sd_to_si _sd_to_di _sd_to_usi _sd_to_udi _si_to_sd _di_to_sd _usi_to_sd _udi_to_sd _sd_to_sf _sd_to_df _sd_to_xf _sd_to_tf _sf_to_sd _df_to_sd _xf_to_sd _tf_to_sd _sd_to_dd _sd_to_td _unord_sd _conv_sd' >> tmp-libgcc.mvars
echo D64PBIT='' >> tmp-libgcc.mvars
echo D64PBIT_FUNCS='_addsub_dd _div_dd _mul_dd _plus_dd _minus_dd _eq_dd _ne_dd _lt_dd _gt_dd _le_dd _ge_dd _dd_to_si _dd_to_di _dd_to_usi _dd_to_udi _si_to_dd _di_to_dd _usi_to_dd _udi_to_dd _dd_to_sf _dd_to_df _dd_to_xf _dd_to_tf _sf_to_dd _df_to_dd _xf_to_dd _tf_to_dd _dd_to_sd _dd_to_td _unord_dd _conv_dd' >> tmp-libgcc.mvars
echo D128PBIT='' >> tmp-libgcc.mvars
echo D128PBIT_FUNCS='_addsub_td _div_td _mul_td _plus_td _minus_td _eq_td _ne_td _lt_td _gt_td _le_td _ge_td _td_to_si _td_to_di _td_to_usi _td_to_udi _si_to_td _di_to_td _usi_to_td _udi_to_td _td_to_sf _td_to_df _td_to_xf _td_to_tf _sf_to_td _df_to_td _xf_to_td _tf_to_td _td_to_sd _td_to_dd _unord_td _conv_td' >> tmp-libgcc.mvars
echo GCC_EXTRA_PARTS = 'crtbegin.o crtbeginP.o crtbeginS.o crtbeginT.o crtend.o crtendS.o crtfastmath.o crtprec32.o crtprec64.o crtprec80.o' >> tmp-libgcc.mvars
echo SHLIB_LINK = '$(GCC_FOR_TARGET) -O2 -g -O2 -pipe -DIN_GCC -W -Wall -Wwrite-strings -Wcast-qual -Wstrict-prototypes -Wmissing-prototypes -Wold-style-definition -isystem ./include -fPIC -g -DHAVE_GTHR_DEFAULT -DIN_LIBGCC2 -D__GCC_FLOAT_NOT_NEEDED -fno-stack-protector -shared -nodefaultlibs -Wl,--soname=@shlib_base_name@.so.1 -Wl,--version-script=@shlib_map_file@ -o @multilib_dir@/@shlib_base_name@.so.1.tmp @multilib_flags@ @shlib_objs@ -lc && rm -f @multilib_dir@/@shlib_base_name@.so && if [ -f @multilib_dir@/@shlib_base_name@.so.1 ]; then mv -f @multilib_dir@/@shlib_base_name@.so.1 @multilib_dir@/@shlib_base_name@.so.1.backup; else true; fi && mv @multilib_dir@/@shlib_base_name@.so.1.tmp @multilib_dir@/@shlib_base_name@.so.1 && ln -s @shlib_base_name@.so.1 @multilib_dir@/@shlib_base_name@.so' >> tmp-libgcc.mvars
echo SHLIB_INSTALL = '$(mkinstalldirs) $(DESTDIR)$(slibdir)@shlib_slibdir_qual@; /usr/bin/install -c -m 644 @multilib_dir@/@shlib_base_name@.so.1 $(DESTDIR)$(slibdir)@shlib_slibdir_qual@/@shlib_base_name@.so.1; rm -f $(DESTDIR)$(slibdir)@shlib_slibdir_qual@/@shlib_base_name@.so; ln -s @shlib_base_name@.so.1 $(DESTDIR)$(slibdir)@shlib_slibdir_qual@/@shlib_base_name@.so' >> tmp-libgcc.mvars
echo SHLIB_EXT = '.so' >> tmp-libgcc.mvars
echo SHLIB_MKMAP = '$(gcc_srcdir)/mkmap-symver.awk ' >> tmp-libgcc.mvars
echo SHLIB_MKMAP_OPTS = '' >> tmp-libgcc.mvars
echo SHLIB_MAPFILES = '$(gcc_srcdir)/libgcc-std.ver $(gcc_srcdir)/config/i386/libgcc-glibc.ver ' >> tmp-libgcc.mvars
echo SHLIB_NM_FLAGS = '-pg' >> tmp-libgcc.mvars
echo LIBGCC2_CFLAGS = '-O2 -g -O2 -pipe -DIN_GCC -W -Wall -Wwrite-strings -Wcast-qual -Wstrict-prototypes -Wmissing-prototypes -Wold-style-definition -isystem ./include -fPIC -g -DHAVE_GTHR_DEFAULT -DIN_LIBGCC2 -D__GCC_FLOAT_NOT_NEEDED -fno-stack-protector' >> tmp-libgcc.mvars
echo TARGET_LIBGCC2_CFLAGS = '-fPIC' >> tmp-libgcc.mvars
echo LIBGCC_SYNC = '' >> tmp-libgcc.mvars
echo LIBGCC_SYNC_CFLAGS = '' >> tmp-libgcc.mvars
echo CRTSTUFF_CFLAGS = '-O2 -g -O2 -pipe -DIN_GCC -W -Wall -Wwrite-strings -Wcast-qual -Wstrict-prototypes -Wmissing-prototypes -Wold-style-definition -isystem ./include -I. -I. -I/var/tmp/portage/sys-devel/gcc-4.5.4/work/gcc-4.5.4/gcc -I/var/tmp/portage/sys-devel/gcc-4.5.4/work/gcc-4.5.4/gcc/. -I/var/tmp/portage/sys-devel/gcc-4.5.4/work/gcc-4.5.4/gcc/../include -I/var/tmp/portage/sys-devel/gcc-4.5.4/work/gcc-4.5.4/gcc/../libcpp/include -I/var/tmp/portage/sys-devel/gcc-4.5.4/work/gcc-4.5.4/gcc/../libdecnumber -I/var/tmp/portage/sys-devel/gcc-4.5.4/work/gcc-4.5.4/gcc/../libdecnumber/bid -I../libdecnumber -g0 -finhibit-size-directive -fno-inline -fno-exceptions -fno-zero-initialized-in-bss -fno-toplevel-reorder -fno-tree-vectorize -fno-stack-protector' >> tmp-libgcc.mvars
echo CRTSTUFF_T_CFLAGS = ' -fno-omit-frame-pointer -fno-asynchronous-unwind-tables -fno-PIE' >> tmp-libgcc.mvars
echo CRTSTUFF_T_CFLAGS_S = ' -fno-omit-frame-pointer -fno-asynchronous-unwind-tables -fPIC' >> tmp-libgcc.mvars
echo TARGET_SYSTEM_ROOT = '' >> tmp-libgcc.mvars
echo enable_crtbeginP = 'yes' >> tmp-libgcc.mvars
mv tmp-libgcc.mvars libgcc.mvars
rm -rf libbackend.a
x86_64-pc-linux-gnu-ar rc libbackend.a insn-attrtab.o insn-automata.o insn-emit.o insn-extract.o insn-modes.o insn-opinit.o insn-output.o insn-peep.o insn-preds.o insn-recog.o ggc-page.o alias.o alloc-pool.o auto-inc-dec.o bb-reorder.o bitmap.o bt-load.o builtins.o caller-save.o calls.o cfg.o cfganal.o cfgbuild.o cfgcleanup.o cfgexpand.o cfghooks.o cfglayout.o cfgloop.o cfgloopanal.o cfgloopmanip.o cfgrtl.o combine.o combine-stack-adj.o convert.o coverage.o cse.o cselib.o dbxout.o dbgcnt.o dce.o ddg.o debug.o df-byte-scan.o df-core.o df-problems.o df-scan.o dfp.o diagnostic.o dojump.o dominance.o domwalk.o double-int.o dse.o dwarf2asm.o dwarf2out.o ebitmap.o emit-rtl.o et-forest.o except.o explow.o expmed.o expr.o final.o fixed-value.o fold-const.o function.o fwprop.o gcse.o genrtl.o ggc-common.o gimple.o gimple-iterator.o gimple-low.o gimple-pretty-print.o gimplify.o graph.o graphds.o graphite.o graphite-blocking.o graphite-clast-to-gimple.o graphite-dependences.o graphite-i
nterchange.o graphite-poly.o graphite-ppl.o graphite-scop-detection.o graphite-sese-to-poly.o gtype-desc.o haifa-sched.o hooks.o ifcvt.o init-regs.o integrate.o intl.o ira.o ira-build.o ira-costs.o ira-conflicts.o ira-color.o ira-emit.o ira-lives.o jump.o lambda-code.o lambda-mat.o lambda-trans.o langhooks.o lcm.o lists.o loop-doloop.o loop-init.o loop-invariant.o loop-iv.o loop-unroll.o loop-unswitch.o lower-subreg.o lto-cgraph.o lto-streamer-in.o lto-streamer-out.o lto-section-in.o lto-section-out.o lto-symtab.o lto-opts.o lto-streamer.o lto-wpa-fixup.o lto-compress.o mcf.o mode-switching.o modulo-sched.o omega.o omp-low.o optabs.o options.o opts-common.o opts.o params.o passes.o plugin.o pointer-set.o postreload-gcse.o postreload.o predict.o pretty-print.o print-rtl.o print-tree.o profile.o real.o recog.o reg-stack.o regcprop.o reginfo.o regmove.o regrename.o regstat.o reload.o reload1.o reorg.o resource.o rtl-error.o rtl.o rtlanal.o rtlhooks.o sbitmap.o sched-deps.o sche
d-ebb.o sched-rgn.o sched-vis.o sdbout.o sel-sched-ir.o sel-sched-dump.o sel-sched.o sese.o simplify-rtx.o sparseset.o sreal.o stack-ptr-mod.o statistics.o stmt.o stor-layout.o store-motion.o stringpool.o targhooks.o timevar.o toplev.o tracer.o tree-affine.o tree-call-cdce.o tree-cfg.o tree-cfgcleanup.o tree-chrec.o tree-complex.o tree-data-ref.o tree-dfa.o tree-dump.o tree-eh.o tree-if-conv.o tree-into-ssa.o tree-iterator.o tree-loop-distribution.o tree-loop-linear.o tree-nested.o tree-nrv.o tree-object-size.o tree-optimize.o tree-outof-ssa.o tree-parloops.o tree-phinodes.o tree-predcom.o tree-pretty-print.o tree-profile.o tree-scalar-evolution.o tree-sra.o tree-switch-conversion.o tree-ssa-address.o tree-ssa-alias.o tree-ssa-ccp.o tree-ssa-coalesce.o tree-ssa-copy.o tree-ssa-copyrename.o tree-ssa-dce.o tree-ssa-dom.o tree-ssa-dse.o tree-ssa-forwprop.o tree-ssa-ifcombine.o tree-ssa-live.o tree-ssa-loop-ch.o tree-ssa-loop-im.o tree-ssa-loop-ivcanon.o tree-ssa-loop-ivopts.o t
ree-ssa-loop-manip.o tree-ssa-loop-niter.o tree-ssa-loop-prefetch.o tree-ssa-loop-unswitch.o tree-ssa-loop.o tree-ssa-math-opts.o tree-ssa-operands.o tree-ssa-phiopt.o tree-ssa-phiprop.o tree-ssa-pre.o tree-ssa-propagate.o tree-ssa-reassoc.o tree-ssa-sccvn.o tree-ssa-sink.o tree-ssa-structalias.o tree-ssa-ter.o tree-ssa-threadedge.o tree-ssa-threadupdate.o tree-ssa-uncprop.o tree-ssa.o tree-ssanames.o tree-stdarg.o tree-tailcall.o tree-vect-generic.o tree-vect-patterns.o tree-vect-data-refs.o tree-vect-stmts.o tree-vect-loop.o tree-vect-loop-manip.o tree-vect-slp.o tree-vectorizer.o tree-vrp.o tree.o value-prof.o var-tracking.o varasm.o varray.o vec.o version.o vmsdbgout.o web.o xcoffout.o i386.o host-linux.o cgraph.o cgraphbuild.o cgraphunit.o cppdefault.o incpath.o ipa-cp.o ipa-inline.o ipa-prop.o ipa-pure-const.o ipa-reference.o ipa-struct-reorg.o ipa-type-escape.o ipa-utils.o ipa.o matrix-reorg.o prefix.o tree-inline.o tree-nomudflap.o varpool.o
x86_64-pc-linux-gnu-ranlib libbackend.a
x86_64-pc-linux-gnu-ranlib: libbackend.a: No space left on device
make[3]: [libbackend.a] Error 1 (ignored)
/var/tmp/portage/sys-devel/gcc-4.5.4/work/build/./prev-gcc/xgcc -B/var/tmp/portage/sys-devel/gcc-4.5.4/work/build/./prev-gcc/ -B/usr/x86_64-pc-linux-gnu/bin/ -B/usr/x86_64-pc-linux-gnu/bin/ -B/usr/x86_64-pc-linux-gnu/lib/ -isystem /usr/x86_64-pc-linux-gnu/include -isystem /usr/x86_64-pc-linux-gnu/sys-include -DEFAULT_RELRO -DEFAULT_BIND_NOW -DEFAULT_PIE_SSP -fno-PIE -m64 -O2 -pipe -gtoggle -DIN_GCC -W -Wall -Wwrite-strings -Wcast-qual -Wstrict-prototypes -Wmissing-prototypes -Wmissing-format-attribute -pedantic -Wno-long-long -Wno-variadic-macros -Wno-overlength-strings -Wold-style-definition -Wc++-compat -DHAVE_CONFIG_H -o cc1-dummy c-lang.o stub-objc.o attribs.o c-errors.o c-lex.o c-pragma.o c-decl.o c-typeck.o c-convert.o c-aux-info.o c-common.o c-opts.o c-format.o c-semantics.o c-ppoutput.o c-cppbuiltin.o c-objc-common.o c-dump.o c-pch.o c-parser.o i386-c.o c-gimplify.o tree-mudflap.o c-pretty-print.o c-omp.o \
dummy-checksum.o main.o libbackend.a ../libcpp/libcpp.a ../libdecnumber/libdecnumber.a ../libcpp/libcpp.a ../libiberty/libiberty.a ../libdecnumber/libdecnumber.a -lmpc -lmpfr -lgmp -rdynamic -ldl -lz
/var/tmp/portage/sys-devel/gcc-4.5.4/work/build/./prev-gcc/xgcc -B/var/tmp/portage/sys-devel/gcc-4.5.4/work/build/./prev-gcc/ -B/usr/x86_64-pc-linux-gnu/bin/ -B/usr/x86_64-pc-linux-gnu/bin/ -B/usr/x86_64-pc-linux-gnu/lib/ -isystem /usr/x86_64-pc-linux-gnu/include -isystem /usr/x86_64-pc-linux-gnu/sys-include -DEFAULT_RELRO -DEFAULT_BIND_NOW -DEFAULT_PIE_SSP -fno-PIE -m64 -O2 -pipe -gtoggle -DIN_GCC -W -Wall -Wwrite-strings -Wcast-qual -Wstrict-prototypes -Wmissing-prototypes -Wmissing-format-attribute -pedantic -Wno-long-long -Wno-variadic-macros -Wno-overlength-strings -Wold-style-definition -Wc++-compat -DHAVE_CONFIG_H -o cc1plus-dummy \
cp/cp-lang.o stub-objc.o cp/call.o cp/decl.o cp/expr.o cp/pt.o cp/typeck2.o cp/class.o cp/decl2.o cp/error.o cp/lex.o cp/parser.o cp/ptree.o cp/rtti.o cp/typeck.o cp/cvt.o cp/except.o cp/friend.o cp/init.o cp/method.o cp/search.o cp/semantics.o cp/tree.o cp/repo.o cp/dump.o cp/optimize.o cp/mangle.o cp/cp-objcp-common.o cp/name-lookup.o cp/cxx-pretty-print.o cp/cp-gimplify.o tree-mudflap.o attribs.o c-common.o c-format.o c-pragma.o c-semantics.o c-lex.o c-dump.o i386-c.o c-pretty-print.o c-opts.o c-pch.o incpath.o c-ppoutput.o c-cppbuiltin.o prefix.o c-gimplify.o c-omp.o dummy-checksum.o main.o libbackend.a ../libcpp/libcpp.a ../libdecnumber/libdecnumber.a ../libcpp/libcpp.a ../libiberty/libiberty.a ../libdecnumber/libdecnumber.a -lmpc -lmpfr -lgmp -rdynamic -ldl -lz
collect2: ld returned 1 exit status
make[3]: *** [cc1plus-dummy] Error 1
make[3]: *** Waiting for unfinished jobs....
collect2: ld returned 1 exit status
make[3]: *** [cc1-dummy] Error 1
rm gcc.pod
make[3]: Leaving directory `/var/tmp/portage/sys-devel/gcc-4.5.4/work/build/gcc'
make[2]: *** [all-stage2-gcc] Error 2
make[2]: Leaving directory `/var/tmp/portage/sys-devel/gcc-4.5.4/work/build'
make[1]: *** [stage2-bubble] Error 2
make[1]: Leaving directory `/var/tmp/portage/sys-devel/gcc-4.5.4/work/build'
make: *** [bootstrap-lean] Error 2
emake failed
* ERROR: sys-devel/gcc-4.5.4 failed (compile phase):
* emake failed with bootstrap-lean
*
* Call stack:
* ebuild.sh, line 85: Called src_compile
* environment, line 4077: Called toolchain_src_compile
* environment, line 4717: Called gcc_do_make
* environment, line 2405: Called die
* The specific snippet of code:
* emake LDFLAGS="${LDFLAGS}" STAGE1_CFLAGS="${STAGE1_CFLAGS}" LIBPATH="${LIBPATH}" BOOT_CFLAGS="${BOOT_CFLAGS}" ${GCC_MAKE_TARGET} || die "emake failed with ${GCC_MAKE_TARGET}";
*
* If you need support, post the output of `emerge --info '=sys-devel/gcc-4.5.4'`,
* the complete build log and the output of `emerge -pqv '=sys-devel/gcc-4.5.4'`.
*
* Please include /var/tmp/portage/sys-devel/gcc-4.5.4/work/build/gcc-build-logs.tar.bz2 in your bug report
*
* The complete build log is located at '/var/tmp/portage/sys-devel/gcc-4.5.4/temp/build.log'.
* The ebuild environment file is located at '/var/tmp/portage/sys-devel/gcc-4.5.4/temp/environment'.
* Working directory: '/var/tmp/portage/sys-devel/gcc-4.5.4/work/build'
* S: '/var/tmp/portage/sys-devel/gcc-4.5.4/work/build'
* Messages for package sys-libs/timezone-data-2012c:
* You do not have TIMEZONE set in /etc/timezone.
* Skipping auto-update of /etc/localtime.
* Messages for package app-portage/portage-utils-0.10:
* /etc/portage/postsync.d/q-reinitialize has been installed for convenience
* If you wish for it to be automatically run at the end of every --sync:
* # chmod +x /etc/portage/postsync.d/q-reinitialize
* Normally this should only take a few seconds to run but file systems
* such as ext3 can take a lot longer. To disable, simply do:
* # chmod -x /etc/portage/postsync.d/q-reinitialize
* Messages for package sys-apps/baselayout-2.1-r1:
* You should reboot the system now to get /run mounted with tmpfs!
* Messages for package sys-libs/glibc-2.15-r2:
* Generating all locales; edit /etc/locale.gen to save time/space
* Messages for package sys-libs/gdbm-1.8.3-r4:
* 32bit systems might have to rebuild all gdbm databases due to
* LFS changes in the gdbm format. You can either delete the db
* and regenerate it from scratch, or use the converter:
* http://bugs.gentoo.org/attachment.cgi?id=215326
*
* See this comment for information on how to use it:
* http://bugs.gentoo.org/299390#c15
*
* You should be able to locate most gdbm db's on your system with:
* find /etc /var -type f -exec file {} + | grep 'GNU dbm 1.x or ndbm database'
*
* You could also try using this helper script:
* http://bugs.gentoo.org/attachment.cgi?id=222581
* Messages for package sys-apps/util-linux-2.20.1-r2:
* The agetty util now clears the terminal by default. You
* might want to add --noclear to your /etc/inittab lines.
* Messages for package sys-devel/gcc-4.5.4:
* ERROR: sys-devel/gcc-4.5.4 failed (compile phase):
* emake failed with bootstrap-lean
*
* Call stack:
* ebuild.sh, line 85: Called src_compile
* environment, line 4077: Called toolchain_src_compile
* environment, line 4717: Called gcc_do_make
* environment, line 2405: Called die
* The specific snippet of code:
* emake LDFLAGS="${LDFLAGS}" STAGE1_CFLAGS="${STAGE1_CFLAGS}" LIBPATH="${LIBPATH}" BOOT_CFLAGS="${BOOT_CFLAGS}" ${GCC_MAKE_TARGET} || die "emake failed with ${GCC_MAKE_TARGET}";
*
* If you need support, post the output of `emerge --info '=sys-devel/gcc-4.5.4'`,
* the complete build log and the output of `emerge -pqv '=sys-devel/gcc-4.5.4'`.
*
* Please include /var/tmp/portage/sys-devel/gcc-4.5.4/work/build/gcc-build-logs.tar.bz2 in your bug report
*
* The complete build log is located at '/var/tmp/portage/sys-devel/gcc-4.5.4/temp/build.log'.
* The ebuild environment file is located at '/var/tmp/portage/sys-devel/gcc-4.5.4/temp/environment'.
* Working directory: '/var/tmp/portage/sys-devel/gcc-4.5.4/work/build'
* S: '/var/tmp/portage/sys-devel/gcc-4.5.4/work/build'
!!! catalyst: run script failed.
Traceback (most recent call last):
File "modules/generic_stage_target.py", line 1194, in run_local
"run script failed.",env=self.env)
File "/usr/lib64/catalyst/modules/catalyst_support.py", line 542, in cmd
raise CatalystError,myexc
CatalystError
None
!!! catalyst: Stage build aborting due to error.
Traceback (most recent call last):
File "/usr/lib64/catalyst/catalyst", line 206, in build_target
mytarget.run()
File "modules/generic_stage_target.py", line 1254, in run
apply(getattr(self,x))
File "modules/generic_stage_target.py", line 1199, in run_local
raise CatalystError,"Stage build aborting due to error."
CatalystError
!!! catalyst: Error encountered during run of target stage3
Catalyst aborting....
lockfile does not exist '/release/buildroot/amd64-dev/tmp/hardened/stage3-amd64-hardened-20120823/.catalyst_lock'
Full build log at /tmp/catalyst-auto.20934/log/hardened_stage3.log
^ permalink raw reply [flat|nested] 24+ messages in thread
* [gentoo-releng-autobuilds] [amd64-auto] Catalyst fatal build error - hardened/stage3.spec
@ 2014-11-24 15:09 catalyst
0 siblings, 0 replies; 24+ messages in thread
From: catalyst @ 2014-11-24 15:09 UTC (permalink / raw
To: jmbsvicetto, gentoo-releng-autobuilds
fi
/bin/sh /var/tmp/portage/sys-devel/gcc-4.8.3/work/gcc-4.8.3/gcc/../move-if-change tmp-mlib.h multilib.h
echo timestamp > s-mlib
lsf="/var/tmp/portage/sys-devel/gcc-4.8.3/work/gcc-4.8.3/gcc/cp/lang-specs.h /var/tmp/portage/sys-devel/gcc-4.8.3/work/gcc-4.8.3/gcc/lto/lang-specs.h"; for f in $lsf; do \
echo "#include \"$f\""; \
done | sed 's|/var/tmp/portage/sys-devel/gcc-4.8.3/work/gcc-4.8.3/gcc/||' > tmp-specs.h
/bin/sh /var/tmp/portage/sys-devel/gcc-4.8.3/work/gcc-4.8.3/gcc/../move-if-change tmp-specs.h specs.h
echo timestamp > s-specs
echo "x86_64-pc-linux-gnu-g++ -DEFAULT_PIE_SSP -fno-PIE -DIN_GCC -fno-exceptions -fno-rtti -fasynchronous-unwind-tables -W -Wall -Wno-narrowing -Wwrite-strings -Wcast-qual -Wmissing-format-attribute -pedantic -Wno-long-long -Wno-variadic-macros -Wno-overlength-strings -DHAVE_CONFIG_H -static-libstdc++ -static-libgcc -Wl,-O1 -Wl,--as-needed" > checksum-options.tmp \
&& /var/tmp/portage/sys-devel/gcc-4.8.3/work/gcc-4.8.3/gcc/../move-if-change checksum-options.tmp checksum-options
gawk -f /var/tmp/portage/sys-devel/gcc-4.8.3/work/gcc-4.8.3/gcc/config/i386/i386-builtin-types.awk /var/tmp/portage/sys-devel/gcc-4.8.3/work/gcc-4.8.3/gcc/config/i386/i386-builtin-types.def > tmp-bt.inc
/bin/sh /var/tmp/portage/sys-devel/gcc-4.8.3/work/gcc-4.8.3/gcc/../move-if-change tmp-bt.inc i386-builtin-types.inc
echo timestamp > s-i386-bt
cp /var/tmp/portage/sys-devel/gcc-4.8.3/work/gcc-4.8.3/gcc/gcc-ar.c gcc-nm.c
cp /var/tmp/portage/sys-devel/gcc-4.8.3/work/gcc-4.8.3/gcc/gcc-ar.c gcc-ranlib.c
rm -f mm_malloc.h
cat /var/tmp/portage/sys-devel/gcc-4.8.3/work/gcc-4.8.3/gcc/config/i386/pmm_malloc.h > mm_malloc.h
TARGET_CPU_DEFAULT="" \
HEADERS="auto-host.h ansidecl.h" DEFINES="USED_FOR_TARGET " \
/bin/sh /var/tmp/portage/sys-devel/gcc-4.8.3/work/gcc-4.8.3/gcc/mkconfig.sh tconfig.h
(echo "@set version-GCC 4.8.3"; \
if [ "" = "experimental" ]; \
then echo "@set DEVELOPMENT"; \
else echo "@clear DEVELOPMENT"; \
fi) > gcc-vers.texiT
echo @set srcdir /var/tmp/portage/sys-devel/gcc-4.8.3/work/gcc-4.8.3/gcc >> gcc-vers.texiT
if [ -n "(Gentoo Hardened 4.8.3 p1.1, pie-0.5.9) " ]; then \
echo "@set VERSION_PACKAGE (Gentoo Hardened 4.8.3 p1.1, pie-0.5.9) " >> gcc-vers.texiT; \
fi
echo "@set BUGURL @uref{https://bugs.gentoo.org/}" >> gcc-vers.texiT; \
mv -f gcc-vers.texiT gcc-vers.texi
echo timestamp > gpl.pod
perl /var/tmp/portage/sys-devel/gcc-4.8.3/work/gcc-4.8.3/gcc/../contrib/texi2pod.pl /var/tmp/portage/sys-devel/gcc-4.8.3/work/gcc-4.8.3/gcc/doc/include/gpl_v3.texi > gpl.pod
x86_64-pc-linux-gnu-g++ -c -DEFAULT_PIE_SSP -fno-PIE -DSTANDARD_STARTFILE_PREFIX=\"../../../\" -DSTANDARD_EXEC_PREFIX=\"/usr/lib/gcc/\" -DSTANDARD_LIBEXEC_PREFIX=\"/usr/libexec/gcc/\" -DDEFAULT_TARGET_VERSION=\"4.8.3\" -DDEFAULT_TARGET_MACHINE=\"x86_64-pc-linux-gnu\" -DSTANDARD_BINDIR_PREFIX=\"/usr/x86_64-pc-linux-gnu/gcc-bin/4.8.3/\" -DTOOLDIR_BASE_PREFIX=\"../../../../\" `test "X${SHLIB}" = "X" || test "yes" != "yes" || echo "-DENABLE_SHARED_LIBGCC"` -DCONFIGURE_SPECS="\"\"" -DTARGET_MACHINE=\"x86_64-pc-linux-gnu\" -DPERSONALITY=\"ar\" -DIN_GCC -fno-exceptions -fno-rtti -fasynchronous-unwind-tables -W -Wall -Wno-narrowing -Wwrite-strings -Wcast-qual -Wmissing-format-attribute -pedantic -Wno-long-long -Wno-variadic-macros -Wno-overlength-strings -DHAVE_CONFIG_H -I. -I. -I/var/tmp/portage/sys-devel/gcc-4.8.3/work/gcc-4.8.3/gcc -I/var/tmp/portage/sys-devel/gcc-4.8.3/work/gcc-4.8.3/gcc/. -I/var/tmp/portage/sys-devel/gcc-4.8.3/work/gcc-4.8.3/gcc/../include -I/var/tmp/portage/sy
s-devel/gcc-4.8.3/work/gcc-4.8.3/gcc/../libcpp/include -I/var/tmp/portage/sys-devel/gcc-4.8.3/work/gcc-4.8.3/gcc/../libdecnumber -I/var/tmp/portage/sys-devel/gcc-4.8.3/work/gcc-4.8.3/gcc/../libdecnumber/bid -I../libdecnumber -I/var/tmp/portage/sys-devel/gcc-4.8.3/work/gcc-4.8.3/gcc/../libbacktrace /var/tmp/portage/sys-devel/gcc-4.8.3/work/gcc-4.8.3/gcc/gcc-ar.c -o gcc-ar.o
x86_64-pc-linux-gnu-g++ -c -DEFAULT_PIE_SSP -fno-PIE -DSTANDARD_STARTFILE_PREFIX=\"../../../\" -DSTANDARD_EXEC_PREFIX=\"/usr/lib/gcc/\" -DSTANDARD_LIBEXEC_PREFIX=\"/usr/libexec/gcc/\" -DDEFAULT_TARGET_VERSION=\"4.8.3\" -DDEFAULT_TARGET_MACHINE=\"x86_64-pc-linux-gnu\" -DSTANDARD_BINDIR_PREFIX=\"/usr/x86_64-pc-linux-gnu/gcc-bin/4.8.3/\" -DTOOLDIR_BASE_PREFIX=\"../../../../\" `test "X${SHLIB}" = "X" || test "yes" != "yes" || echo "-DENABLE_SHARED_LIBGCC"` -DCONFIGURE_SPECS="\"\"" -DTARGET_MACHINE=\"x86_64-pc-linux-gnu\" -DPERSONALITY=\"nm\" -DIN_GCC -fno-exceptions -fno-rtti -fasynchronous-unwind-tables -W -Wall -Wno-narrowing -Wwrite-strings -Wcast-qual -Wmissing-format-attribute -pedantic -Wno-long-long -Wno-variadic-macros -Wno-overlength-strings -DHAVE_CONFIG_H -I. -I. -I/var/tmp/portage/sys-devel/gcc-4.8.3/work/gcc-4.8.3/gcc -I/var/tmp/portage/sys-devel/gcc-4.8.3/work/gcc-4.8.3/gcc/. -I/var/tmp/portage/sys-devel/gcc-4.8.3/work/gcc-4.8.3/gcc/../include -I/var/tmp/portage/sy
s-devel/gcc-4.8.3/work/gcc-4.8.3/gcc/../libcpp/include -I/var/tmp/portage/sys-devel/gcc-4.8.3/work/gcc-4.8.3/gcc/../libdecnumber -I/var/tmp/portage/sys-devel/gcc-4.8.3/work/gcc-4.8.3/gcc/../libdecnumber/bid -I../libdecnumber -I/var/tmp/portage/sys-devel/gcc-4.8.3/work/gcc-4.8.3/gcc/../libbacktrace gcc-nm.c -o gcc-nm.o
x86_64-pc-linux-gnu-g++ -c -DEFAULT_PIE_SSP -fno-PIE -DSTANDARD_STARTFILE_PREFIX=\"../../../\" -DSTANDARD_EXEC_PREFIX=\"/usr/lib/gcc/\" -DSTANDARD_LIBEXEC_PREFIX=\"/usr/libexec/gcc/\" -DDEFAULT_TARGET_VERSION=\"4.8.3\" -DDEFAULT_TARGET_MACHINE=\"x86_64-pc-linux-gnu\" -DSTANDARD_BINDIR_PREFIX=\"/usr/x86_64-pc-linux-gnu/gcc-bin/4.8.3/\" -DTOOLDIR_BASE_PREFIX=\"../../../../\" `test "X${SHLIB}" = "X" || test "yes" != "yes" || echo "-DENABLE_SHARED_LIBGCC"` -DCONFIGURE_SPECS="\"\"" -DTARGET_MACHINE=\"x86_64-pc-linux-gnu\" -DPERSONALITY=\"ranlib\" -DIN_GCC -fno-exceptions -fno-rtti -fasynchronous-unwind-tables -W -Wall -Wno-narrowing -Wwrite-strings -Wcast-qual -Wmissing-format-attribute -pedantic -Wno-long-long -Wno-variadic-macros -Wno-overlength-strings -DHAVE_CONFIG_H -I. -I. -I/var/tmp/portage/sys-devel/gcc-4.8.3/work/gcc-4.8.3/gcc -I/var/tmp/portage/sys-devel/gcc-4.8.3/work/gcc-4.8.3/gcc/. -I/var/tmp/portage/sys-devel/gcc-4.8.3/work/gcc-4.8.3/gcc/../include -I/var/tmp/portag
e/sys-devel/gcc-4.8.3/work/gcc-4.8.3/gcc/../libcpp/include -I/var/tmp/portage/sys-devel/gcc-4.8.3/work/gcc-4.8.3/gcc/../libdecnumber -I/var/tmp/portage/sys-devel/gcc-4.8.3/work/gcc-4.8.3/gcc/../libdecnumber/bid -I../libdecnumber -I/var/tmp/portage/sys-devel/gcc-4.8.3/work/gcc-4.8.3/gcc/../libbacktrace gcc-ranlib.c -o gcc-ranlib.o
x86_64-pc-linux-gnu-g++ -c -DEFAULT_PIE_SSP -fno-PIE -DGENERATOR_FILE -DIN_GCC -fno-exceptions -fno-rtti -fasynchronous-unwind-tables -W -Wall -Wno-narrowing -Wwrite-strings -Wcast-qual -Wmissing-format-attribute -pedantic -Wno-long-long -Wno-variadic-macros -Wno-overlength-strings -DHAVE_CONFIG_H -I. -I. -I/var/tmp/portage/sys-devel/gcc-4.8.3/work/gcc-4.8.3/gcc -I/var/tmp/portage/sys-devel/gcc-4.8.3/work/gcc-4.8.3/gcc/. -I/var/tmp/portage/sys-devel/gcc-4.8.3/work/gcc-4.8.3/gcc/../include -I/var/tmp/portage/sys-devel/gcc-4.8.3/work/gcc-4.8.3/gcc/../libcpp/include -I/var/tmp/portage/sys-devel/gcc-4.8.3/work/gcc-4.8.3/gcc/../libdecnumber -I/var/tmp/portage/sys-devel/gcc-4.8.3/work/gcc-4.8.3/gcc/../libdecnumber/bid -I../libdecnumber -I/var/tmp/portage/sys-devel/gcc-4.8.3/work/gcc-4.8.3/gcc/../libbacktrace /var/tmp/portage/sys-devel/gcc-4.8.3/work/gcc-4.8.3/gcc/gengtype.c -o gengtype.o
/var/tmp/portage/sys-devel/gcc-4.8.3/work/gcc-4.8.3/gcc/gengtype.c:21:21: fatal error: bconfig.h: No such file or directory
#include "bconfig.h"
^
compilation terminated.
Makefile:1070: recipe for target 'gengtype.o' failed
make[3]: *** [gengtype.o] Error 1
make[3]: Leaving directory '/var/tmp/portage/sys-devel/gcc-4.8.3/work/build/gcc'
Makefile:4153: recipe for target 'all-stage1-gcc' failed
make[2]: *** [all-stage1-gcc] Error 2
make[2]: Leaving directory '/var/tmp/portage/sys-devel/gcc-4.8.3/work/build'
Makefile:16937: recipe for target 'stage1-bubble' failed
make[1]: *** [stage1-bubble] Error 2
make[1]: Leaving directory '/var/tmp/portage/sys-devel/gcc-4.8.3/work/build'
Makefile:17252: recipe for target 'bootstrap-lean' failed
make: *** [bootstrap-lean] Error 2
* ERROR: sys-devel/gcc-4.8.3::gentoo failed (compile phase):
* emake failed
*
* If you need support, post the output of `emerge --info '=sys-devel/gcc-4.8.3::gentoo'`,
* the complete build log and the output of `emerge -pqv '=sys-devel/gcc-4.8.3::gentoo'`.
* The complete build log is located at '/var/log/portage/sys-devel:gcc-4.8.3:20141124-150817.log'.
* For convenience, a symlink to the build log is located at '/var/tmp/portage/sys-devel/gcc-4.8.3/temp/build.log'.
* The ebuild environment file is located at '/var/tmp/portage/sys-devel/gcc-4.8.3/temp/environment'.
* Working directory: '/var/tmp/portage/sys-devel/gcc-4.8.3/work/build'
* S: '/var/tmp/portage/sys-devel/gcc-4.8.3/work/gcc-4.8.3'
*
* Please include /var/tmp/portage/sys-devel/gcc-4.8.3/work/gcc-build-logs.tar.bz2 in your bug report.
*
* Messages for package sys-libs/timezone-data-2014i-r1:
* You do not have TIMEZONE set in /etc/timezone.
* Skipping auto-update of /etc/localtime.
* Messages for package sys-apps/baselayout-2.2:
* The following users have non-existent shells!
* halt - /sbin/halt
* shutdown - /sbin/shutdown
* Messages for package app-portage/portage-utils-0.53:
* /etc/portage/postsync.d/q-reinitialize has been installed for convenience
* If you wish for it to be automatically run at the end of every --sync:
* # chmod +x /etc/portage/postsync.d/q-reinitialize
* Normally this should only take a few seconds to run but file systems
* such as ext3 can take a lot longer. To disable, simply do:
* # chmod -x /etc/portage/postsync.d/q-reinitialize
* Messages for package sys-apps/sysvinit-2.88-r7:
* The last/lastb/mesg/mountpoint/sulogin/utmpdump/wall tools have been moved to
* sys-apps/util-linux. The pidof tool has been moved to sys-process/procps.
* Messages for package sys-libs/glibc-2.19-r1:
* Defaulting /etc/host.conf:multi to on
* Generating all locales; edit /etc/locale.gen to save time/space
* Messages for package sys-apps/coreutils-8.21:
* Make sure you run 'hash -r' in your active shells.
* You should also re-source your shell settings for LS_COLORS
* changes, such as: source /etc/profile
* Messages for package dev-python/setuptools-2.2:
* It seems that you need to set USE_PYTHON to make sure that legacy
* packages will be built with respect to PYTHON_TARGETS correctly:
*
* USE_PYTHON='^[[35;1m2.7^[[0m'
*
* Please note that after changing the USE_PYTHON variable, you may need
* to run 'python-updater' to rebuild affected packages.
*
* For more information on PYTHON_TARGETS and python.eclass
* compatibility, please see the relevant Wiki article [1].
*
* [1] https://wiki.gentoo.org/wiki/Project:Python/PYTHON_TARGETS
* Could not find a UTF-8 locale. This may trigger build failures in
* some python packages. Please ensure that a UTF-8 locale is listed in
* /etc/locale.gen and run locale-gen.
* Messages for package dev-python/pyxattr-0.5.2:
* Could not find a UTF-8 locale. This may trigger build failures in
* some python packages. Please ensure that a UTF-8 locale is listed in
* /etc/locale.gen and run locale-gen.
* It seems that you need to set USE_PYTHON to make sure that legacy
* packages will be built with respect to PYTHON_TARGETS correctly:
*
* USE_PYTHON='^[[35;1m2.7^[[0m'
*
* Please note that after changing the USE_PYTHON variable, you may need
* to run 'python-updater' to rebuild affected packages.
*
* For more information on PYTHON_TARGETS and python.eclass
* compatibility, please see the relevant Wiki article [1].
*
* [1] https://wiki.gentoo.org/wiki/Project:Python/PYTHON_TARGETS
* Messages for package sys-apps/less-458:
* lesspipe offers colorization options. Run 'lesspipe -h' for info.
* Messages for package dev-python/pypax-0.8.4:
* Could not find a UTF-8 locale. This may trigger build failures in
* some python packages. Please ensure that a UTF-8 locale is listed in
* /etc/locale.gen and run locale-gen.
* It seems that you need to set USE_PYTHON to make sure that legacy
* packages will be built with respect to PYTHON_TARGETS correctly:
*
* USE_PYTHON='^[[35;1m2.7^[[0m'
*
* Please note that after changing the USE_PYTHON variable, you may need
* to run 'python-updater' to rebuild affected packages.
*
* For more information on PYTHON_TARGETS and python.eclass
* compatibility, please see the relevant Wiki article [1].
*
* [1] https://wiki.gentoo.org/wiki/Project:Python/PYTHON_TARGETS
* Messages for package sys-devel/gcc-4.8.3:
* ERROR: sys-devel/gcc-4.8.3::gentoo failed (compile phase):
* emake failed
*
* If you need support, post the output of `emerge --info '=sys-devel/gcc-4.8.3::gentoo'`,
* the complete build log and the output of `emerge -pqv '=sys-devel/gcc-4.8.3::gentoo'`.
* The complete build log is located at '/var/log/portage/sys-devel:gcc-4.8.3:20141124-150817.log'.
* For convenience, a symlink to the build log is located at '/var/tmp/portage/sys-devel/gcc-4.8.3/temp/build.log'.
* The ebuild environment file is located at '/var/tmp/portage/sys-devel/gcc-4.8.3/temp/environment'.
* Working directory: '/var/tmp/portage/sys-devel/gcc-4.8.3/work/build'
* S: '/var/tmp/portage/sys-devel/gcc-4.8.3/work/gcc-4.8.3'
*
* Please include /var/tmp/portage/sys-devel/gcc-4.8.3/work/gcc-build-logs.tar.bz2 in your bug report.
*
!!! catalyst: run script failed.
Traceback (most recent call last):
File "modules/generic_stage_target.py", line 1244, in run_local
"run script failed.",env=self.env)
File "/usr/lib64/catalyst//modules/catalyst_support.py", line 541, in cmd
raise CatalystError,myexc
CatalystError
None
!!! catalyst: Stage build aborting due to error.
Traceback (most recent call last):
File "/usr/lib64/catalyst/catalyst", line 218, in build_target
mytarget.run()
File "modules/generic_stage_target.py", line 1304, in run
apply(getattr(self,x))
File "modules/generic_stage_target.py", line 1249, in run_local
raise CatalystError,"Stage build aborting due to error."
CatalystError
!!! catalyst: Error encountered during run of target stage3
Catalyst aborting....
lockfile does not exist '/home/release/buildroot/amd64-dev/tmp/hardened/stage3-amd64-hardened-20141124/.catalyst_lock'
Full build log at /home/release/tmp/run/catalyst-auto.9AfpSA/log/hardened_stage3.log
^ permalink raw reply [flat|nested] 24+ messages in thread
* [gentoo-releng-autobuilds] [amd64-auto] Catalyst fatal build error - hardened/stage3.spec
@ 2014-12-07 7:52 catalyst
0 siblings, 0 replies; 24+ messages in thread
From: catalyst @ 2014-12-07 7:52 UTC (permalink / raw
To: jmbsvicetto, gentoo-releng-autobuilds
config.status: creating as
config.status: creating collect-ld
config.status: creating nm
config.status: creating Makefile
config.status: creating ada/gcc-interface/Makefile
config.status: creating ada/Makefile
config.status: creating auto-host.h
config.status: executing default commands
make[3]: Entering directory '/var/tmp/portage/sys-devel/gcc-4.8.3/work/build/gcc'
TARGET_CPU_DEFAULT="" \
HEADERS="auto-host.h ansidecl.h" DEFINES="" \
/bin/sh /var/tmp/portage/sys-devel/gcc-4.8.3/work/gcc-4.8.3/gcc/mkconfig.sh config.h
x86_64-pc-linux-gnu-g++ -c -DEFAULT_PIE_SSP -fno-PIE -DIN_GCC -fno-exceptions -fno-rtti -fasynchronous-unwind-tables -W -Wall -Wno-narrowing -Wwrite-strings -Wcast-qual -Wmissing-format-attribute -pedantic -Wno-long-long -Wno-variadic-macros -Wno-overlength-strings -DHAVE_CONFIG_H -DGENERATOR_FILE -I. -Ibuild -I/var/tmp/portage/sys-devel/gcc-4.8.3/work/gcc-4.8.3/gcc -I/var/tmp/portage/sys-devel/gcc-4.8.3/work/gcc-4.8.3/gcc/build -I/var/tmp/portage/sys-devel/gcc-4.8.3/work/gcc-4.8.3/gcc/../include -I/var/tmp/portage/sys-devel/gcc-4.8.3/work/gcc-4.8.3/gcc/../libcpp/include \
-DBASEVER="\"4.8.3\"" -DDATESTAMP="\"\"" \
-DREVISION="\"\"" \
-DDEVPHASE="\"\"" -DPKGVERSION="\"(Gentoo Hardened 4.8.3 p1.1, pie-0.5.9) \"" \
-DBUGURL="\"<https://bugs.gentoo.org/>\"" -o build/version.o /var/tmp/portage/sys-devel/gcc-4.8.3/work/gcc-4.8.3/gcc/version.c
if test yes = yes \
|| test -n "m64=../lib64 m32=../lib32 mx32=../libx32"; then \
/bin/sh /var/tmp/portage/sys-devel/gcc-4.8.3/work/gcc-4.8.3/gcc/genmultilib \
"m32/m64" \
" 32 64" \
"" \
"" \
"" \
"" \
"m64=../lib64 m32=../lib32 mx32=../libx32" \
"" \
"" \
"" \
"yes" \
> tmp-mlib.h; \
else \
/bin/sh /var/tmp/portage/sys-devel/gcc-4.8.3/work/gcc-4.8.3/gcc/genmultilib '' '' '' '' '' '' '' '' \
"" '' no \
> tmp-mlib.h; \
fi
/bin/sh /var/tmp/portage/sys-devel/gcc-4.8.3/work/gcc-4.8.3/gcc/../move-if-change tmp-mlib.h multilib.h
echo timestamp > s-mlib
lsf="/var/tmp/portage/sys-devel/gcc-4.8.3/work/gcc-4.8.3/gcc/cp/lang-specs.h /var/tmp/portage/sys-devel/gcc-4.8.3/work/gcc-4.8.3/gcc/lto/lang-specs.h"; for f in $lsf; do \
echo "#include \"$f\""; \
done | sed 's|/var/tmp/portage/sys-devel/gcc-4.8.3/work/gcc-4.8.3/gcc/||' > tmp-specs.h
/bin/sh /var/tmp/portage/sys-devel/gcc-4.8.3/work/gcc-4.8.3/gcc/../move-if-change tmp-specs.h specs.h
echo timestamp > s-specs
echo "x86_64-pc-linux-gnu-g++ -DEFAULT_PIE_SSP -fno-PIE -DIN_GCC -fno-exceptions -fno-rtti -fasynchronous-unwind-tables -W -Wall -Wno-narrowing -Wwrite-strings -Wcast-qual -Wmissing-format-attribute -pedantic -Wno-long-long -Wno-variadic-macros -Wno-overlength-strings -DHAVE_CONFIG_H -static-libstdc++ -static-libgcc -Wl,-O1 -Wl,--as-needed" > checksum-options.tmp \
&& /var/tmp/portage/sys-devel/gcc-4.8.3/work/gcc-4.8.3/gcc/../move-if-change checksum-options.tmp checksum-options
gawk -f /var/tmp/portage/sys-devel/gcc-4.8.3/work/gcc-4.8.3/gcc/config/i386/i386-builtin-types.awk /var/tmp/portage/sys-devel/gcc-4.8.3/work/gcc-4.8.3/gcc/config/i386/i386-builtin-types.def > tmp-bt.inc
/bin/sh /var/tmp/portage/sys-devel/gcc-4.8.3/work/gcc-4.8.3/gcc/../move-if-change tmp-bt.inc i386-builtin-types.inc
echo timestamp > s-i386-bt
cp /var/tmp/portage/sys-devel/gcc-4.8.3/work/gcc-4.8.3/gcc/gcc-ar.c gcc-nm.c
cp /var/tmp/portage/sys-devel/gcc-4.8.3/work/gcc-4.8.3/gcc/gcc-ar.c gcc-ranlib.c
rm -f mm_malloc.h
cat /var/tmp/portage/sys-devel/gcc-4.8.3/work/gcc-4.8.3/gcc/config/i386/pmm_malloc.h > mm_malloc.h
TARGET_CPU_DEFAULT="" \
HEADERS="auto-host.h ansidecl.h" DEFINES="USED_FOR_TARGET " \
/bin/sh /var/tmp/portage/sys-devel/gcc-4.8.3/work/gcc-4.8.3/gcc/mkconfig.sh tconfig.h
(echo "@set version-GCC 4.8.3"; \
if [ "" = "experimental" ]; \
then echo "@set DEVELOPMENT"; \
else echo "@clear DEVELOPMENT"; \
fi) > gcc-vers.texiT
echo @set srcdir /var/tmp/portage/sys-devel/gcc-4.8.3/work/gcc-4.8.3/gcc >> gcc-vers.texiT
if [ -n "(Gentoo Hardened 4.8.3 p1.1, pie-0.5.9) " ]; then \
echo "@set VERSION_PACKAGE (Gentoo Hardened 4.8.3 p1.1, pie-0.5.9) " >> gcc-vers.texiT; \
fi
echo "@set BUGURL @uref{https://bugs.gentoo.org/}" >> gcc-vers.texiT; \
mv -f gcc-vers.texiT gcc-vers.texi
echo timestamp > gpl.pod
perl /var/tmp/portage/sys-devel/gcc-4.8.3/work/gcc-4.8.3/gcc/../contrib/texi2pod.pl /var/tmp/portage/sys-devel/gcc-4.8.3/work/gcc-4.8.3/gcc/doc/include/gpl_v3.texi > gpl.pod
x86_64-pc-linux-gnu-g++ -c -DEFAULT_PIE_SSP -fno-PIE -DSTANDARD_STARTFILE_PREFIX=\"../../../\" -DSTANDARD_EXEC_PREFIX=\"/usr/lib/gcc/\" -DSTANDARD_LIBEXEC_PREFIX=\"/usr/libexec/gcc/\" -DDEFAULT_TARGET_VERSION=\"4.8.3\" -DDEFAULT_TARGET_MACHINE=\"x86_64-pc-linux-gnu\" -DSTANDARD_BINDIR_PREFIX=\"/usr/x86_64-pc-linux-gnu/gcc-bin/4.8.3/\" -DTOOLDIR_BASE_PREFIX=\"../../../../\" `test "X${SHLIB}" = "X" || test "yes" != "yes" || echo "-DENABLE_SHARED_LIBGCC"` -DCONFIGURE_SPECS="\"\"" -DTARGET_MACHINE=\"x86_64-pc-linux-gnu\" -DPERSONALITY=\"ar\" -DIN_GCC -fno-exceptions -fno-rtti -fasynchronous-unwind-tables -W -Wall -Wno-narrowing -Wwrite-strings -Wcast-qual -Wmissing-format-attribute -pedantic -Wno-long-long -Wno-variadic-macros -Wno-overlength-strings -DHAVE_CONFIG_H -I. -I. -I/var/tmp/portage/sys-devel/gcc-4.8.3/work/gcc-4.8.3/gcc -I/var/tmp/portage/sys-devel/gcc-4.8.3/work/gcc-4.8.3/gcc/. -I/var/tmp/portage/sys-devel/gcc-4.8.3/work/gcc-4.8.3/gcc/../include -I/var/tmp/portage/sy
s-devel/gcc-4.8.3/work/gcc-4.8.3/gcc/../libcpp/include -I/var/tmp/portage/sys-devel/gcc-4.8.3/work/gcc-4.8.3/gcc/../libdecnumber -I/var/tmp/portage/sys-devel/gcc-4.8.3/work/gcc-4.8.3/gcc/../libdecnumber/bid -I../libdecnumber -I/var/tmp/portage/sys-devel/gcc-4.8.3/work/gcc-4.8.3/gcc/../libbacktrace /var/tmp/portage/sys-devel/gcc-4.8.3/work/gcc-4.8.3/gcc/gcc-ar.c -o gcc-ar.o
x86_64-pc-linux-gnu-g++ -c -DEFAULT_PIE_SSP -fno-PIE -DSTANDARD_STARTFILE_PREFIX=\"../../../\" -DSTANDARD_EXEC_PREFIX=\"/usr/lib/gcc/\" -DSTANDARD_LIBEXEC_PREFIX=\"/usr/libexec/gcc/\" -DDEFAULT_TARGET_VERSION=\"4.8.3\" -DDEFAULT_TARGET_MACHINE=\"x86_64-pc-linux-gnu\" -DSTANDARD_BINDIR_PREFIX=\"/usr/x86_64-pc-linux-gnu/gcc-bin/4.8.3/\" -DTOOLDIR_BASE_PREFIX=\"../../../../\" `test "X${SHLIB}" = "X" || test "yes" != "yes" || echo "-DENABLE_SHARED_LIBGCC"` -DCONFIGURE_SPECS="\"\"" -DTARGET_MACHINE=\"x86_64-pc-linux-gnu\" -DPERSONALITY=\"nm\" -DIN_GCC -fno-exceptions -fno-rtti -fasynchronous-unwind-tables -W -Wall -Wno-narrowing -Wwrite-strings -Wcast-qual -Wmissing-format-attribute -pedantic -Wno-long-long -Wno-variadic-macros -Wno-overlength-strings -DHAVE_CONFIG_H -I. -I. -I/var/tmp/portage/sys-devel/gcc-4.8.3/work/gcc-4.8.3/gcc -I/var/tmp/portage/sys-devel/gcc-4.8.3/work/gcc-4.8.3/gcc/. -I/var/tmp/portage/sys-devel/gcc-4.8.3/work/gcc-4.8.3/gcc/../include -I/var/tmp/portage/sy
s-devel/gcc-4.8.3/work/gcc-4.8.3/gcc/../libcpp/include -I/var/tmp/portage/sys-devel/gcc-4.8.3/work/gcc-4.8.3/gcc/../libdecnumber -I/var/tmp/portage/sys-devel/gcc-4.8.3/work/gcc-4.8.3/gcc/../libdecnumber/bid -I../libdecnumber -I/var/tmp/portage/sys-devel/gcc-4.8.3/work/gcc-4.8.3/gcc/../libbacktrace gcc-nm.c -o gcc-nm.o
x86_64-pc-linux-gnu-g++ -c -DEFAULT_PIE_SSP -fno-PIE -DSTANDARD_STARTFILE_PREFIX=\"../../../\" -DSTANDARD_EXEC_PREFIX=\"/usr/lib/gcc/\" -DSTANDARD_LIBEXEC_PREFIX=\"/usr/libexec/gcc/\" -DDEFAULT_TARGET_VERSION=\"4.8.3\" -DDEFAULT_TARGET_MACHINE=\"x86_64-pc-linux-gnu\" -DSTANDARD_BINDIR_PREFIX=\"/usr/x86_64-pc-linux-gnu/gcc-bin/4.8.3/\" -DTOOLDIR_BASE_PREFIX=\"../../../../\" `test "X${SHLIB}" = "X" || test "yes" != "yes" || echo "-DENABLE_SHARED_LIBGCC"` -DCONFIGURE_SPECS="\"\"" -DTARGET_MACHINE=\"x86_64-pc-linux-gnu\" -DPERSONALITY=\"ranlib\" -DIN_GCC -fno-exceptions -fno-rtti -fasynchronous-unwind-tables -W -Wall -Wno-narrowing -Wwrite-strings -Wcast-qual -Wmissing-format-attribute -pedantic -Wno-long-long -Wno-variadic-macros -Wno-overlength-strings -DHAVE_CONFIG_H -I. -I. -I/var/tmp/portage/sys-devel/gcc-4.8.3/work/gcc-4.8.3/gcc -I/var/tmp/portage/sys-devel/gcc-4.8.3/work/gcc-4.8.3/gcc/. -I/var/tmp/portage/sys-devel/gcc-4.8.3/work/gcc-4.8.3/gcc/../include -I/var/tmp/portag
e/sys-devel/gcc-4.8.3/work/gcc-4.8.3/gcc/../libcpp/include -I/var/tmp/portage/sys-devel/gcc-4.8.3/work/gcc-4.8.3/gcc/../libdecnumber -I/var/tmp/portage/sys-devel/gcc-4.8.3/work/gcc-4.8.3/gcc/../libdecnumber/bid -I../libdecnumber -I/var/tmp/portage/sys-devel/gcc-4.8.3/work/gcc-4.8.3/gcc/../libbacktrace gcc-ranlib.c -o gcc-ranlib.o
x86_64-pc-linux-gnu-g++ -c -DEFAULT_PIE_SSP -fno-PIE -DGENERATOR_FILE -DIN_GCC -fno-exceptions -fno-rtti -fasynchronous-unwind-tables -W -Wall -Wno-narrowing -Wwrite-strings -Wcast-qual -Wmissing-format-attribute -pedantic -Wno-long-long -Wno-variadic-macros -Wno-overlength-strings -DHAVE_CONFIG_H -I. -I. -I/var/tmp/portage/sys-devel/gcc-4.8.3/work/gcc-4.8.3/gcc -I/var/tmp/portage/sys-devel/gcc-4.8.3/work/gcc-4.8.3/gcc/. -I/var/tmp/portage/sys-devel/gcc-4.8.3/work/gcc-4.8.3/gcc/../include -I/var/tmp/portage/sys-devel/gcc-4.8.3/work/gcc-4.8.3/gcc/../libcpp/include -I/var/tmp/portage/sys-devel/gcc-4.8.3/work/gcc-4.8.3/gcc/../libdecnumber -I/var/tmp/portage/sys-devel/gcc-4.8.3/work/gcc-4.8.3/gcc/../libdecnumber/bid -I../libdecnumber -I/var/tmp/portage/sys-devel/gcc-4.8.3/work/gcc-4.8.3/gcc/../libbacktrace /var/tmp/portage/sys-devel/gcc-4.8.3/work/gcc-4.8.3/gcc/gengtype.c -o gengtype.o
/var/tmp/portage/sys-devel/gcc-4.8.3/work/gcc-4.8.3/gcc/gengtype.c:21:21: fatal error: bconfig.h: No such file or directory
#include "bconfig.h"
^
compilation terminated.
Makefile:1070: recipe for target 'gengtype.o' failed
make[3]: *** [gengtype.o] Error 1
make[3]: Leaving directory '/var/tmp/portage/sys-devel/gcc-4.8.3/work/build/gcc'
Makefile:4153: recipe for target 'all-stage1-gcc' failed
make[2]: *** [all-stage1-gcc] Error 2
make[2]: Leaving directory '/var/tmp/portage/sys-devel/gcc-4.8.3/work/build'
Makefile:16937: recipe for target 'stage1-bubble' failed
make[1]: *** [stage1-bubble] Error 2
make[1]: Leaving directory '/var/tmp/portage/sys-devel/gcc-4.8.3/work/build'
Makefile:17252: recipe for target 'bootstrap-lean' failed
make: *** [bootstrap-lean] Error 2
* ERROR: sys-devel/gcc-4.8.3::gentoo failed (compile phase):
* emake failed
*
* If you need support, post the output of `emerge --info '=sys-devel/gcc-4.8.3::gentoo'`,
* the complete build log and the output of `emerge -pqv '=sys-devel/gcc-4.8.3::gentoo'`.
* The complete build log is located at '/var/log/portage/sys-devel:gcc-4.8.3:20141207-074952.log'.
* For convenience, a symlink to the build log is located at '/var/tmp/portage/sys-devel/gcc-4.8.3/temp/build.log'.
* The ebuild environment file is located at '/var/tmp/portage/sys-devel/gcc-4.8.3/temp/environment'.
* Working directory: '/var/tmp/portage/sys-devel/gcc-4.8.3/work/build'
* S: '/var/tmp/portage/sys-devel/gcc-4.8.3/work/gcc-4.8.3'
*
* Please include /var/tmp/portage/sys-devel/gcc-4.8.3/work/gcc-build-logs.tar.bz2 in your bug report.
*
* Messages for package sys-libs/timezone-data-2014i-r1:
* You do not have TIMEZONE set in /etc/timezone.
* Skipping auto-update of /etc/localtime.
* Messages for package sys-apps/baselayout-2.2:
* The following users have non-existent shells!
* halt - /sbin/halt
* shutdown - /sbin/shutdown
* Messages for package app-portage/portage-utils-0.53:
* /etc/portage/postsync.d/q-reinitialize has been installed for convenience
* If you wish for it to be automatically run at the end of every --sync:
* # chmod +x /etc/portage/postsync.d/q-reinitialize
* Normally this should only take a few seconds to run but file systems
* such as ext3 can take a lot longer. To disable, simply do:
* # chmod -x /etc/portage/postsync.d/q-reinitialize
* Messages for package sys-apps/sysvinit-2.88-r7:
* The last/lastb/mesg/mountpoint/sulogin/utmpdump/wall tools have been moved to
* sys-apps/util-linux. The pidof tool has been moved to sys-process/procps.
* Messages for package dev-python/setuptools-7.0:
* Could not find a UTF-8 locale. This may trigger build failures in
* some python packages. Please ensure that a UTF-8 locale is listed in
* /etc/locale.gen and run locale-gen.
* Messages for package dev-python/pyxattr-0.5.2:
* Could not find a UTF-8 locale. This may trigger build failures in
* some python packages. Please ensure that a UTF-8 locale is listed in
* /etc/locale.gen and run locale-gen.
* Messages for package sys-libs/glibc-2.19-r1:
* Defaulting /etc/host.conf:multi to on
* Generating all locales; edit /etc/locale.gen to save time/space
* Messages for package sys-apps/coreutils-8.21:
* Make sure you run 'hash -r' in your active shells.
* You should also re-source your shell settings for LS_COLORS
* changes, such as: source /etc/profile
* Messages for package sys-apps/less-458:
* lesspipe offers colorization options. Run 'lesspipe -h' for info.
* Messages for package dev-python/pypax-0.8.4:
* Could not find a UTF-8 locale. This may trigger build failures in
* some python packages. Please ensure that a UTF-8 locale is listed in
* /etc/locale.gen and run locale-gen.
* Messages for package sys-devel/gcc-4.8.3:
* ERROR: sys-devel/gcc-4.8.3::gentoo failed (compile phase):
* emake failed
*
* If you need support, post the output of `emerge --info '=sys-devel/gcc-4.8.3::gentoo'`,
* the complete build log and the output of `emerge -pqv '=sys-devel/gcc-4.8.3::gentoo'`.
* The complete build log is located at '/var/log/portage/sys-devel:gcc-4.8.3:20141207-074952.log'.
* For convenience, a symlink to the build log is located at '/var/tmp/portage/sys-devel/gcc-4.8.3/temp/build.log'.
* The ebuild environment file is located at '/var/tmp/portage/sys-devel/gcc-4.8.3/temp/environment'.
* Working directory: '/var/tmp/portage/sys-devel/gcc-4.8.3/work/build'
* S: '/var/tmp/portage/sys-devel/gcc-4.8.3/work/gcc-4.8.3'
*
* Please include /var/tmp/portage/sys-devel/gcc-4.8.3/work/gcc-build-logs.tar.bz2 in your bug report.
*
!!! catalyst: run script failed.
Traceback (most recent call last):
File "modules/generic_stage_target.py", line 1244, in run_local
"run script failed.",env=self.env)
File "/usr/lib64/catalyst//modules/catalyst_support.py", line 541, in cmd
raise CatalystError,myexc
CatalystError
None
!!! catalyst: Stage build aborting due to error.
Traceback (most recent call last):
File "/usr/lib64/catalyst/catalyst", line 218, in build_target
mytarget.run()
File "modules/generic_stage_target.py", line 1304, in run
apply(getattr(self,x))
File "modules/generic_stage_target.py", line 1249, in run_local
raise CatalystError,"Stage build aborting due to error."
CatalystError
!!! catalyst: Error encountered during run of target stage3
Catalyst aborting....
lockfile does not exist '/home/release/buildroot/amd64-dev/tmp/hardened/stage3-amd64-hardened-20141206/.catalyst_lock'
Full build log at /home/release/tmp/run/catalyst-auto.HdMNf1/log/hardened_stage3.log
^ permalink raw reply [flat|nested] 24+ messages in thread
* [gentoo-releng-autobuilds] [amd64-auto] Catalyst fatal build error - hardened/stage3.spec
@ 2015-06-22 9:32 catalyst
0 siblings, 0 replies; 24+ messages in thread
From: catalyst @ 2015-06-22 9:32 UTC (permalink / raw
To: jmbsvicetto, gentoo-releng-autobuilds
done | sed 's|/var/tmp/portage/sys-devel/gcc-4.8.4/work/gcc-4.8.4/gcc/||' >> tmp-all-tree.def
/bin/bash /var/tmp/portage/sys-devel/gcc-4.8.4/work/gcc-4.8.4/gcc/../move-if-change tmp-all-tree.def all-tree.def
echo timestamp > s-alltree
if test yes = yes \
|| test -n "m64=../lib64 m32=../lib32 mx32=../libx32"; then \
/bin/bash /var/tmp/portage/sys-devel/gcc-4.8.4/work/gcc-4.8.4/gcc/genmultilib \
"m32/m64" \
" 32 64" \
"" \
"" \
"" \
"" \
"m64=../lib64 m32=../lib32 mx32=../libx32" \
"" \
"" \
"" \
"yes" \
> tmp-mlib.h; \
else \
/bin/bash /var/tmp/portage/sys-devel/gcc-4.8.4/work/gcc-4.8.4/gcc/genmultilib '' '' '' '' '' '' '' '' \
"" '' no \
> tmp-mlib.h; \
fi
/bin/bash /var/tmp/portage/sys-devel/gcc-4.8.4/work/gcc-4.8.4/gcc/../move-if-change tmp-mlib.h multilib.h
echo timestamp > s-mlib
lsf="/var/tmp/portage/sys-devel/gcc-4.8.4/work/gcc-4.8.4/gcc/cp/lang-specs.h /var/tmp/portage/sys-devel/gcc-4.8.4/work/gcc-4.8.4/gcc/lto/lang-specs.h"; for f in $lsf; do \
echo "#include \"$f\""; \
done | sed 's|/var/tmp/portage/sys-devel/gcc-4.8.4/work/gcc-4.8.4/gcc/||' > tmp-specs.h
/bin/bash /var/tmp/portage/sys-devel/gcc-4.8.4/work/gcc-4.8.4/gcc/../move-if-change tmp-specs.h specs.h
echo timestamp > s-specs
echo "/var/tmp/portage/sys-devel/gcc-4.8.4/work/build/./prev-gcc/xg++ -B/var/tmp/portage/sys-devel/gcc-4.8.4/work/build/./prev-gcc/ -B/usr/x86_64-pc-linux-gnu/bin/ -nostdinc++ -B/var/tmp/portage/sys-devel/gcc-4.8.4/work/build/prev-x86_64-pc-linux-gnu/libstdc++-v3/src/.libs -B/var/tmp/portage/sys-devel/gcc-4.8.4/work/build/prev-x86_64-pc-linux-gnu/libstdc++-v3/libsupc++/.libs -I/var/tmp/portage/sys-devel/gcc-4.8.4/work/build/prev-x86_64-pc-linux-gnu/libstdc++-v3/include/x86_64-pc-linux-gnu -I/var/tmp/portage/sys-devel/gcc-4.8.4/work/build/prev-x86_64-pc-linux-gnu/libstdc++-v3/include -I/var/tmp/portage/sys-devel/gcc-4.8.4/work/gcc-4.8.4/libstdc++-v3/libsupc++ -L/var/tmp/portage/sys-devel/gcc-4.8.4/work/build/prev-x86_64-pc-linux-gnu/libstdc++-v3/src/.libs -L/var/tmp/portage/sys-devel/gcc-4.8.4/work/build/prev-x86_64-pc-linux-gnu/libstdc++-v3/libsupc++/.libs -DEFAULT_PIE_SSP -fno-PIE -m64 -O2 -pipe -DIN_GCC -fno-exceptions -fno-rtti -fasynchronous-unwind-tables -W -Wall -Wno-narr
owing -Wwrite-strings -Wcast-qual -Wmissing-format-attribute -pedantic -Wno-long-long -Wno-variadic-macros -Wno-overlength-strings -DHAVE_CONFIG_H -static-libstdc++ -static-libgcc " > checksum-options.tmp \
&& /var/tmp/portage/sys-devel/gcc-4.8.4/work/gcc-4.8.4/gcc/../move-if-change checksum-options.tmp checksum-options
gawk -f /var/tmp/portage/sys-devel/gcc-4.8.4/work/gcc-4.8.4/gcc/config/i386/i386-builtin-types.awk /var/tmp/portage/sys-devel/gcc-4.8.4/work/gcc-4.8.4/gcc/config/i386/i386-builtin-types.def > tmp-bt.inc
/bin/bash /var/tmp/portage/sys-devel/gcc-4.8.4/work/gcc-4.8.4/gcc/../move-if-change tmp-bt.inc i386-builtin-types.inc
echo timestamp > s-i386-bt
cp /var/tmp/portage/sys-devel/gcc-4.8.4/work/gcc-4.8.4/gcc/gcc-ar.c gcc-nm.c
cp /var/tmp/portage/sys-devel/gcc-4.8.4/work/gcc-4.8.4/gcc/gcc-ar.c gcc-ranlib.c
/var/tmp/portage/sys-devel/gcc-4.8.4/work/build/./prev-gcc/xg++ -B/var/tmp/portage/sys-devel/gcc-4.8.4/work/build/./prev-gcc/ -B/usr/x86_64-pc-linux-gnu/bin/ -nostdinc++ -B/var/tmp/portage/sys-devel/gcc-4.8.4/work/build/prev-x86_64-pc-linux-gnu/libstdc++-v3/src/.libs -B/var/tmp/portage/sys-devel/gcc-4.8.4/work/build/prev-x86_64-pc-linux-gnu/libstdc++-v3/libsupc++/.libs -I/var/tmp/portage/sys-devel/gcc-4.8.4/work/build/prev-x86_64-pc-linux-gnu/libstdc++-v3/include/x86_64-pc-linux-gnu -I/var/tmp/portage/sys-devel/gcc-4.8.4/work/build/prev-x86_64-pc-linux-gnu/libstdc++-v3/include -I/var/tmp/portage/sys-devel/gcc-4.8.4/work/gcc-4.8.4/libstdc++-v3/libsupc++ -L/var/tmp/portage/sys-devel/gcc-4.8.4/work/build/prev-x86_64-pc-linux-gnu/libstdc++-v3/src/.libs -L/var/tmp/portage/sys-devel/gcc-4.8.4/work/build/prev-x86_64-pc-linux-gnu/libstdc++-v3/libsupc++/.libs -c -DEFAULT_PIE_SSP -fno-PIE -DHOST_GENERATOR_FILE -m64 -O2 -pipe -DIN_GCC -fno-exceptions -fno-rtti -fasynchronous-unwind-tables
-W -Wall -Wno-narrowing -Wwrite-strings -Wcast-qual -Wmissing-format-attribute -pedantic -Wno-long-long -Wno-variadic-macros -Wno-overlength-strings -DHAVE_CONFIG_H -I. -I. -I/var/tmp/portage/sys-devel/gcc-4.8.4/work/gcc-4.8.4/gcc -I/var/tmp/portage/sys-devel/gcc-4.8.4/work/gcc-4.8.4/gcc/. -I/var/tmp/portage/sys-devel/gcc-4.8.4/work/gcc-4.8.4/gcc/../include -I/var/tmp/portage/sys-devel/gcc-4.8.4/work/gcc-4.8.4/gcc/../libcpp/include -I/var/tmp/portage/sys-devel/gcc-4.8.4/work/gcc-4.8.4/gcc/../libdecnumber -I/var/tmp/portage/sys-devel/gcc-4.8.4/work/gcc-4.8.4/gcc/../libdecnumber/bid -I../libdecnumber -I/var/tmp/portage/sys-devel/gcc-4.8.4/work/gcc-4.8.4/gcc/../libbacktrace /var/tmp/portage/sys-devel/gcc-4.8.4/work/gcc-4.8.4/gcc/gengtype.c -o gengtype.o
In file included from /var/tmp/portage/sys-devel/gcc-4.8.4/work/gcc-4.8.4/gcc/gengtype.c:26:0:
/var/tmp/portage/sys-devel/gcc-4.8.4/work/gcc-4.8.4/gcc/system.h:500:34: error: declaration of C function 'const char* strsignal(int)' conflicts with
extern const char *strsignal (int);
^
In file included from /var/tmp/portage/sys-devel/gcc-4.8.4/work/build/prev-x86_64-pc-linux-gnu/libstdc++-v3/include/cstring:42:0,
from /var/tmp/portage/sys-devel/gcc-4.8.4/work/gcc-4.8.4/gcc/system.h:205,
from /var/tmp/portage/sys-devel/gcc-4.8.4/work/gcc-4.8.4/gcc/gengtype.c:26:
/usr/include/string.h:563:14: error: previous declaration 'char* strsignal(int)' here
extern char *strsignal (int __sig) __THROW;
^
In file included from /var/tmp/portage/sys-devel/gcc-4.8.4/work/gcc-4.8.4/gcc/system.h:645:0,
from /var/tmp/portage/sys-devel/gcc-4.8.4/work/gcc-4.8.4/gcc/gengtype.c:26:
/var/tmp/portage/sys-devel/gcc-4.8.4/work/gcc-4.8.4/gcc/../include/libiberty.h:110:36: error: new declaration 'char* basename(const char*)'
extern char *basename (const char *);
^
In file included from /var/tmp/portage/sys-devel/gcc-4.8.4/work/build/prev-x86_64-pc-linux-gnu/libstdc++-v3/include/cstring:42:0,
from /var/tmp/portage/sys-devel/gcc-4.8.4/work/gcc-4.8.4/gcc/system.h:205,
from /var/tmp/portage/sys-devel/gcc-4.8.4/work/gcc-4.8.4/gcc/gengtype.c:26:
/usr/include/string.h:600:26: error: ambiguates old declaration 'const char* basename(const char*)'
extern "C++" const char *basename (const char *__filename)
^
In file included from /var/tmp/portage/sys-devel/gcc-4.8.4/work/gcc-4.8.4/gcc/gengtype.c:26:0:
/var/tmp/portage/sys-devel/gcc-4.8.4/work/gcc-4.8.4/gcc/system.h:289:56: error: 'CHAR_BIT' was not declared in this scope
? ~ (t) 0 << (sizeof(t) * CHAR_BIT - 1) : (t) 0))
^
/var/tmp/portage/sys-devel/gcc-4.8.4/work/gcc-4.8.4/gcc/system.h:290:44: note: in expansion of macro 'INTTYPE_MINIMUM'
#define INTTYPE_MAXIMUM(t) ((t) (~ (t) 0 - INTTYPE_MINIMUM (t)))
^
/var/tmp/portage/sys-devel/gcc-4.8.4/work/gcc-4.8.4/gcc/system.h:294:20: note: in expansion of macro 'INTTYPE_MAXIMUM'
# define UCHAR_MAX INTTYPE_MAXIMUM (unsigned char)
^
/var/tmp/portage/sys-devel/gcc-4.8.4/work/gcc-4.8.4/gcc/gengtype.h:455:23: note: in expansion of macro 'UCHAR_MAX'
CHAR_TOKEN_OFFSET = UCHAR_MAX + 1,
^
Makefile:1070: recipe for target 'gengtype.o' failed
make[3]: *** [gengtype.o] Error 1
make[3]: Leaving directory '/var/tmp/portage/sys-devel/gcc-4.8.4/work/build/gcc'
Makefile:4232: recipe for target 'all-stage3-gcc' failed
make[2]: *** [all-stage3-gcc] Error 2
make[2]: Leaving directory '/var/tmp/portage/sys-devel/gcc-4.8.4/work/build'
Makefile:17178: recipe for target 'stage3-bubble' failed
make[1]: *** [stage3-bubble] Error 2
make[1]: Leaving directory '/var/tmp/portage/sys-devel/gcc-4.8.4/work/build'
Makefile:17252: recipe for target 'bootstrap-lean' failed
make: *** [bootstrap-lean] Error 2
* ERROR: sys-devel/gcc-4.8.4::gentoo failed (compile phase):
* emake failed
*
* If you need support, post the output of `emerge --info '=sys-devel/gcc-4.8.4::gentoo'`,
* the complete build log and the output of `emerge -pqv '=sys-devel/gcc-4.8.4::gentoo'`.
* The complete build log is located at '/var/log/portage/sys-devel:gcc-4.8.4:20150622-091458.log'.
* For convenience, a symlink to the build log is located at '/var/tmp/portage/sys-devel/gcc-4.8.4/temp/build.log'.
* The ebuild environment file is located at '/var/tmp/portage/sys-devel/gcc-4.8.4/temp/environment'.
* Working directory: '/var/tmp/portage/sys-devel/gcc-4.8.4/work/build'
* S: '/var/tmp/portage/sys-devel/gcc-4.8.4/work/gcc-4.8.4'
*
* Please include /var/tmp/portage/sys-devel/gcc-4.8.4/work/gcc-build-logs.tar.bz2 in your bug report.
*
* Messages for package sys-libs/timezone-data-2015b:
* You do not have TIMEZONE set in /etc/timezone.
* Skipping auto-update of /etc/localtime.
* Messages for package sys-apps/baselayout-2.2:
* The following users have non-existent shells!
* halt - /sbin/halt
* shutdown - /sbin/shutdown
* Messages for package sys-apps/sysvinit-2.88-r7:
* The last/lastb/mesg/mountpoint/sulogin/utmpdump/wall tools have been moved to
* sys-apps/util-linux. The pidof tool has been moved to sys-process/procps.
* Messages for package dev-python/setuptools-12.0.1:
* Could not find a UTF-8 locale. This may trigger build failures in
* some python packages. Please ensure that a UTF-8 locale is listed in
* /etc/locale.gen and run locale-gen.
* Messages for package dev-python/pyxattr-0.5.3:
* Could not find a UTF-8 locale. This may trigger build failures in
* some python packages. Please ensure that a UTF-8 locale is listed in
* /etc/locale.gen and run locale-gen.
* Messages for package sys-libs/glibc-2.20-r2:
* Defaulting /etc/host.conf:multi to on
* Generating all locales; edit /etc/locale.gen to save time/space
* Messages for package dev-perl/Module-Build-0.420.500:
* This package will overwrite one or more files that may belong to other
* packages (see list below).
*
* Detected file collision(s):
*
* /usr/bin/config_data
* /usr/share/man/man1/config_data.1.bz2
*
* Searching all installed packages for file collisions...
*
* Press Ctrl-C to Stop
*
* None of the installed packages claim the file(s).
*
* Package 'dev-perl/Module-Build-0.420.500' merged despite file
* collisions. If necessary, refer to your elog messages for the whole
* content of the above message.
* Messages for package sys-apps/coreutils-8.21:
* Make sure you run 'hash -r' in your active shells.
* You should also re-source your shell settings for LS_COLORS
* changes, such as: source /etc/profile
* Messages for package sys-apps/less-458:
* lesspipe offers colorization options. Run 'lesspipe -h' for info.
* Messages for package sys-devel/gcc-4.8.4:
* ERROR: sys-devel/gcc-4.8.4::gentoo failed (compile phase):
* emake failed
*
* If you need support, post the output of `emerge --info '=sys-devel/gcc-4.8.4::gentoo'`,
* the complete build log and the output of `emerge -pqv '=sys-devel/gcc-4.8.4::gentoo'`.
* The complete build log is located at '/var/log/portage/sys-devel:gcc-4.8.4:20150622-091458.log'.
* For convenience, a symlink to the build log is located at '/var/tmp/portage/sys-devel/gcc-4.8.4/temp/build.log'.
* The ebuild environment file is located at '/var/tmp/portage/sys-devel/gcc-4.8.4/temp/environment'.
* Working directory: '/var/tmp/portage/sys-devel/gcc-4.8.4/work/build'
* S: '/var/tmp/portage/sys-devel/gcc-4.8.4/work/gcc-4.8.4'
*
* Please include /var/tmp/portage/sys-devel/gcc-4.8.4/work/gcc-build-logs.tar.bz2 in your bug report.
*
!!! catalyst: run script failed.
Traceback (most recent call last):
File "modules/generic_stage_target.py", line 1253, in run_local
"run script failed.",env=self.env)
File "/usr/lib64/catalyst//modules/catalyst_support.py", line 541, in cmd
raise CatalystError,myexc
CatalystError
None
!!! catalyst: Stage build aborting due to error.
Traceback (most recent call last):
File "/usr/lib64/catalyst/catalyst", line 218, in build_target
mytarget.run()
File "modules/generic_stage_target.py", line 1333, in run
apply(getattr(self,x))
File "modules/generic_stage_target.py", line 1258, in run_local
raise CatalystError,"Stage build aborting due to error."
CatalystError
!!! catalyst: Error encountered during run of target stage3
Catalyst aborting....
lockfile does not exist '/home/release/buildroot/amd64-dev/tmp/hardened/stage3-amd64-hardened-20150622/.catalyst_lock'
Full build log at /home/release/tmp/run/catalyst-auto.2Gzn51/log/hardened_stage3.log
^ permalink raw reply [flat|nested] 24+ messages in thread
* [gentoo-releng-autobuilds] [amd64-auto] Catalyst fatal build error - hardened/stage3.spec
@ 2015-11-26 7:02 catalyst
0 siblings, 0 replies; 24+ messages in thread
From: catalyst @ 2015-11-26 7:02 UTC (permalink / raw
To: releng, gentoo-releng-autobuilds
Catalyst, version 2.0.18
Copyright 2003-2008 Gentoo Foundation
Copyright 2008-2012 various authors
Distributed under the GNU General Public License version 2.1
Using command line specified Catalyst configuration file, /etc/catalyst/release/amd64-auto.conf
Setting sharedir to config file value "/usr/lib64/catalyst/"
Setting snapshot_cache to config file value "/release/tmp/snapshots"
Setting hash_function to config file value "crc32"
Setting storedir to config file value "/release/buildroot/amd64-dev"
Setting portdir to config file value "/release/trees/portage-auto"
Setting distdir to config file value "/usr/portage/distfiles"
Setting options to config file value "autoresume bindist pkgcache preserve_libs seedcache snapcache"
Autoresuming support enabled.
Binary redistribution enabled
Package cache support enabled.
Preserving libs during unmerge.
Seed cache support enabled.
Snapshot cache support enabled.
Envscript support enabled.
Using target: stage3
Building natively for amd64
Source path set to /release/buildroot/amd64-dev/tmp/hardened/stage2-amd64-hardened-20151126/
If this is not desired, remove this directory or turn off
seedcache in the options of catalyst.conf the source path
will then be /release/buildroot/amd64-dev/builds/hardened/stage2-amd64-hardened-20151126.tar.bz2
Caching snapshot to /release/tmp/snapshots/20151126/
The autoresume path is /release/buildroot/amd64-dev/tmp/hardened/.autoresume-stage3-amd64-hardened-20151126/
Location of the package cache is /release/buildroot/amd64-dev/packages/hardened/stage3-amd64-hardened-20151126/
Checking for processes running in chroot and killing them.
Removing AutoResume Points: ...
Emptying directory /release/buildroot/amd64-dev/tmp/hardened/.autoresume-stage3-amd64-hardened-20151126/
>>> Waiting 10 seconds before starting...
>>> (Control-C to abort)...
Purging Caches ... in: 10 9 8 7 6 5 4 3 2 1
clearing autoresume ...
Removing AutoResume Points: ...
Emptying directory /release/buildroot/amd64-dev/tmp/hardened/.autoresume-stage3-amd64-hardened-20151126/
clearing chroot ...
Emptying directory /release/buildroot/amd64-dev/tmp/hardened/stage3-amd64-hardened-20151126/
clearing package cache ...
purging the pkgcache ...
clearing kerncache ...
--- Running action sequence: unpack
Starting rsync from /release/buildroot/amd64-dev/tmp/hardened/stage2-amd64-hardened-20151126/
to /release/buildroot/amd64-dev/tmp/hardened/stage3-amd64-hardened-20151126/ (This may take some time) ...
--- Running action sequence: unpack_snapshot
Valid snapshot cache, skipping unpack of portage tree...
--- Running action sequence: setup_confdir
Configuring /etc/portage...
--- Running action sequence: portage_overlay
--- Running action sequence: base_dirs
--- Running action sequence: bind
--- Running action sequence: chroot_setup
Setting up chroot...
Warning!!!!
Overriding certain env variables may cause catastrophic failure.
If your build fails look here first as the possible problem.
Catalyst assumes you know what you are doing when setting
these variables.
Catalyst Maintainers use VERY minimal envscripts if used at all
You have been warned
--- Running action sequence: setup_environment
--- Running action sequence: run_local
Copying stage3-chroot.sh to /tmp
copying stage3-chroot.sh to /release/buildroot/amd64-dev/tmp/hardened/stage3-amd64-hardened-20151126//tmp
copying chroot-functions.sh to /release/buildroot/amd64-dev/tmp/hardened/stage3-amd64-hardened-20151126//tmp
Ensure the file has the executable bit set
Running stage3-chroot.sh in chroot /release/buildroot/amd64-dev/tmp/hardened/stage3-amd64-hardened-20151126/
>>> Regenerating /etc/ld.so.cache...
Updating portage with USE=''
emerge --quiet --usepkg --buildpkg --newuse --oneshot --update --newuse sys-apps/portage
>>> Verifying ebuild manifests
>>> Emerging (1 of 8) sys-libs/gdbm-1.11::gentoo
>>> Installing (1 of 8) sys-libs/gdbm-1.11::gentoo
>>> Emerging (2 of 8) app-misc/mime-types-9::gentoo
>>> Installing (2 of 8) app-misc/mime-types-9::gentoo
>>> Emerging (3 of 8) sys-apps/debianutils-4.4::gentoo
>>> Installing (3 of 8) sys-apps/debianutils-4.4::gentoo
>>> Emerging (4 of 8) dev-libs/openssl-1.0.2d::gentoo
>>> Installing (4 of 8) dev-libs/openssl-1.0.2d::gentoo
>>> Emerging (5 of 8) app-misc/ca-certificates-20140927.3.17.2::gentoo
>>> Installing (5 of 8) app-misc/ca-certificates-20140927.3.17.2::gentoo
>>> Emerging (6 of 8) dev-lang/python-2.7.10-r1::gentoo
>>> Installing (6 of 8) dev-lang/python-2.7.10-r1::gentoo
>>> Emerging (7 of 8) dev-lang/python-3.4.3::gentoo
>>> Installing (7 of 8) dev-lang/python-3.4.3::gentoo
>>> Emerging (8 of 8) sys-apps/portage-2.2.20.1::gentoo
>>> Installing (8 of 8) sys-apps/portage-2.2.20.1::gentoo
* Messages for package app-misc/ca-certificates-20140927.3.17.2:
* You should run update-ca-certificates manually after etc-update
* Messages for package sys-apps/portage-2.2.20.1:
* Could not find a UTF-8 locale. This may trigger build failures in
* some python packages. Please ensure that a UTF-8 locale is listed in
* /etc/locale.gen and run locale-gen.
emerge --quiet --usepkg --buildpkg --newuse -e @system
[nomerge ] sys-apps/util-linux-2.26.2::gentoo USE="cramfs ncurses nls pam suid unicode -caps -fdformat -python (-selinux) -slang -static-libs -systemd {-test} -tty-helpers -udev" ABI_X86="(64) -32 (-x32)" PYTHON_SINGLE_TARGET="python2_7 -python3_3 -python3_4" PYTHON_TARGETS="python2_7 python3_4 -python3_3"
[nomerge ] virtual/pkgconfig-0-r1::gentoo ABI_X86="(64) -32 (-x32)"
[nomerge ] dev-util/pkgconfig-0.28-r2::gentoo USE="hardened -internal-glib*" ABI_X86="(64) -32 (-x32)"
[nomerge ] dev-libs/glib-2.44.1-r1:2::gentoo USE="mime xattr -dbus -debug (-fam) (-selinux) -static-libs -systemtap {-test} -utils" ABI_X86="(64) -32 (-x32)" PYTHON_TARGETS="python2_7"
[ebuild N ] x11-misc/shared-mime-info-1.4::gentoo USE="{-test}" 0 KiB
[ebuild N ] dev-util/desktop-file-utils-0.22::gentoo USE="-emacs" 128 KiB
[ebuild R ] dev-util/pkgconfig-0.28-r2::gentoo USE="hardened -internal-glib*" ABI_X86="(64) -32 (-x32)" 0 KiB
[ebuild N ] dev-libs/glib-2.44.1-r1:2::gentoo USE="mime xattr -dbus -debug (-fam) (-selinux) -static-libs -systemtap {-test} -utils" ABI_X86="(64) -32 (-x32)" PYTHON_TARGETS="python2_7" 0 KiB
Total: 4 packages (3 new, 1 reinstall), Size of downloads: 128 KiB
* Error: circular dependencies:
(dev-libs/glib-2.44.1-r1:2/2::gentoo, ebuild scheduled for merge) depends on
(dev-util/desktop-file-utils-0.22:0/0::gentoo, ebuild scheduled for merge) (buildtime)
(dev-libs/glib-2.44.1-r1:2/2::gentoo, ebuild scheduled for merge) (buildtime)
* Note that circular dependencies can often be avoided by temporarily
* disabling USE flags that trigger optional dependencies.
!!! catalyst: run script failed.
Traceback (most recent call last):
File "modules/generic_stage_target.py", line 1244, in run_local
"run script failed.",env=self.env)
File "/usr/lib64/catalyst//modules/catalyst_support.py", line 541, in cmd
raise CatalystError,myexc
CatalystError
None
!!! catalyst: Stage build aborting due to error.
Traceback (most recent call last):
File "/usr/lib64/catalyst/catalyst", line 218, in build_target
mytarget.run()
File "modules/generic_stage_target.py", line 1304, in run
apply(getattr(self,x))
File "modules/generic_stage_target.py", line 1249, in run_local
raise CatalystError,"Stage build aborting due to error."
CatalystError
!!! catalyst: Error encountered during run of target stage3
Catalyst aborting....
lockfile does not exist '/release/buildroot/amd64-dev/tmp/hardened/stage3-amd64-hardened-20151126/.catalyst_lock'
Full build log at /release/tmp/run/catalyst-auto.XZSNbM/log/hardened_stage3.log
^ permalink raw reply [flat|nested] 24+ messages in thread
* [gentoo-releng-autobuilds] [amd64-auto] Catalyst fatal build error - hardened/stage3.spec
@ 2015-12-25 8:33 catalyst
0 siblings, 0 replies; 24+ messages in thread
From: catalyst @ 2015-12-25 8:33 UTC (permalink / raw
To: releng, gentoo-releng-autobuilds
Catalyst, version 2.0.18
Copyright 2003-2008 Gentoo Foundation
Copyright 2008-2012 various authors
Distributed under the GNU General Public License version 2.1
Using command line specified Catalyst configuration file, /etc/catalyst/release/amd64-auto.conf
Setting sharedir to config file value "/usr/lib64/catalyst/"
Setting snapshot_cache to config file value "/release/tmp/snapshots"
Setting hash_function to config file value "crc32"
Setting storedir to config file value "/release/buildroot/amd64-dev"
Setting portdir to config file value "/release/trees/portage-auto"
Setting distdir to config file value "/usr/portage/distfiles"
Setting options to config file value "autoresume bindist pkgcache preserve_libs seedcache snapcache"
Autoresuming support enabled.
Binary redistribution enabled
Package cache support enabled.
Preserving libs during unmerge.
Seed cache support enabled.
Snapshot cache support enabled.
Envscript support enabled.
Using target: stage3
Building natively for amd64
Source path set to /release/buildroot/amd64-dev/builds/hardened/stage2-amd64-hardened-20151225.tar.bz2
Caching snapshot to /release/tmp/snapshots/20151225/
The autoresume path is /release/buildroot/amd64-dev/tmp/hardened/.autoresume-stage3-amd64-hardened-20151225/
!!! catalyst: Cannot locate specified source_path: /release/buildroot/amd64-dev/builds/hardened/stage2-amd64-hardened-20151225.tar.bz2
Traceback (most recent call last):
File "/usr/lib64/catalyst/catalyst", line 216, in build_target
mytarget=targetmap[addlargs["target"]](conf_values, addlargs)
File "modules/stage3_target.py", line 16, in __init__
generic_stage_target.__init__(self,spec,addlargs)
File "modules/generic_stage_target.py", line 170, in __init__
expand=0)
File "/usr/lib64/catalyst//modules/catalyst_support.py", line 571, in file_locate
raise CatalystError, "Cannot locate specified "+myfile+": "+settings[myfile]
CatalystError
!!! catalyst: Error encountered during run of target stage3
Catalyst aborting....
Full build log at /release/tmp/run/catalyst-auto.W52Wn9/log/hardened_stage3.log
^ permalink raw reply [flat|nested] 24+ messages in thread
* [gentoo-releng-autobuilds] [amd64-auto] Catalyst fatal build error - hardened/stage3.spec
@ 2017-12-11 11:37 catalyst
0 siblings, 0 replies; 24+ messages in thread
From: catalyst @ 2017-12-11 11:37 UTC (permalink / raw
To: jmbsvicetto, gentoo-releng-autobuilds
* As of 2013-01-29, eudev-3.1.5 provides the new interface renaming functionality,
* as described in the URL below:
* https://www.freedesktop.org/wiki/Software/systemd/PredictableNetworkInterfaceNames
*
* This functionality is enabled BY DEFAULT because eudev has no means of synchronizing
* between the default or user-modified choice of sys-fs/udev. If you wish to disable
* this new iface naming, please be sure that /etc/udev/rules.d/80-net-name-slot.rules
* exists: touch /etc/udev/rules.d/80-net-name-slot.rules
*
>>> Emerging (1 of 189) virtual/libintl-0-r2::gentoo
>>> Installing (1 of 189) virtual/libintl-0-r2::gentoo
>>> Emerging (2 of 189) sys-libs/ncurses-6.0-r1::gentoo
>>> Installing (2 of 189) sys-libs/ncurses-6.0-r1::gentoo
>>> Emerging (3 of 189) dev-lang/python-exec-2.4.4::gentoo
>>> Installing (3 of 189) dev-lang/python-exec-2.4.4::gentoo
>>> Emerging (4 of 189) app-arch/bzip2-1.0.6-r8::gentoo
>>> Installing (4 of 189) app-arch/bzip2-1.0.6-r8::gentoo
>>> Emerging (5 of 189) sys-devel/gnuconfig-20161104::gentoo
>>> Installing (5 of 189) sys-devel/gnuconfig-20161104::gentoo
>>> Emerging (6 of 189) sys-apps/gentoo-functions-0.12::gentoo
>>> Installing (6 of 189) sys-apps/gentoo-functions-0.12::gentoo
>>> Emerging (7 of 189) virtual/libiconv-0-r2::gentoo
>>> Installing (7 of 189) virtual/libiconv-0-r2::gentoo
>>> Emerging binary (8 of 189) sys-libs/gdbm-1.11::gentoo
>>> Installing (8 of 189) sys-libs/gdbm-1.11::gentoo
>>> Emerging binary (9 of 189) app-misc/c_rehash-1.7-r1::gentoo
>>> Installing (9 of 189) app-misc/c_rehash-1.7-r1::gentoo
>>> Emerging binary (10 of 189) app-misc/mime-types-9::gentoo
>>> Installing (10 of 189) app-misc/mime-types-9::gentoo
>>> Emerging (11 of 189) app-arch/gzip-1.8::gentoo
>>> Installing (11 of 189) app-arch/gzip-1.8::gentoo
>>> Emerging binary (12 of 189) sys-apps/debianutils-4.7::gentoo
>>> Installing (12 of 189) sys-apps/debianutils-4.7::gentoo
>>> Emerging (13 of 189) app-misc/editor-wrapper-4::gentoo
>>> Installing (13 of 189) app-misc/editor-wrapper-4::gentoo
>>> Emerging (14 of 189) net-libs/libmnl-1.0.4::gentoo
>>> Installing (14 of 189) net-libs/libmnl-1.0.4::gentoo
>>> Emerging (15 of 189) app-text/manpager-1::gentoo
>>> Installing (15 of 189) app-text/manpager-1::gentoo
>>> Emerging (16 of 189) sys-apps/install-xattr-0.5::gentoo
>>> Installing (16 of 189) sys-apps/install-xattr-0.5::gentoo
>>> Emerging (17 of 189) sys-apps/opentmpfiles-0.1.3::gentoo
>>> Installing (17 of 189) sys-apps/opentmpfiles-0.1.3::gentoo
>>> Emerging (18 of 189) sys-apps/which-2.21::gentoo
>>> Installing (18 of 189) sys-apps/which-2.21::gentoo
>>> Emerging (19 of 189) sys-apps/baselayout-2.4.1-r2::gentoo
>>> Installing (19 of 189) sys-apps/baselayout-2.4.1-r2::gentoo
>>> Emerging (20 of 189) app-text/sgml-common-0.6.3-r5::gentoo
>>> Installing (20 of 189) app-text/sgml-common-0.6.3-r5::gentoo
>>> Emerging (21 of 189) sys-devel/autoconf-wrapper-13::gentoo
>>> Installing (21 of 189) sys-devel/autoconf-wrapper-13::gentoo
>>> Emerging (22 of 189) sys-devel/automake-wrapper-10::gentoo
>>> Installing (22 of 189) sys-devel/automake-wrapper-10::gentoo
>>> Emerging (23 of 189) dev-util/gperf-3.0.4::gentoo
>>> Installing (23 of 189) dev-util/gperf-3.0.4::gentoo
>>> Emerging binary (24 of 189) app-misc/ca-certificates-20161130.3.30.2::gentoo
>>> Installing (24 of 189) app-misc/ca-certificates-20161130.3.30.2::gentoo
>>> Emerging (25 of 189) sys-devel/gcc-config-1.8-r1::gentoo
>>> Installing (25 of 189) sys-devel/gcc-config-1.8-r1::gentoo
>>> Emerging (26 of 189) sys-libs/timezone-data-2017a::gentoo
>>> Installing (26 of 189) sys-libs/timezone-data-2017a::gentoo
>>> Emerging (27 of 189) sys-devel/binutils-config-5-r3::gentoo
>>> Installing (27 of 189) sys-devel/binutils-config-5-r3::gentoo
>>> Emerging (28 of 189) virtual/tmpfiles-0::gentoo
>>> Installing (28 of 189) virtual/tmpfiles-0::gentoo
>>> Emerging (29 of 189) app-arch/unzip-6.0_p20::gentoo
>>> Installing (29 of 189) app-arch/unzip-6.0_p20::gentoo
>>> Emerging binary (30 of 189) dev-lang/python-3.4.5::gentoo
>>> Installing (30 of 189) dev-lang/python-3.4.5::gentoo
>>> Emerging binary (31 of 189) dev-lang/python-2.7.14::gentoo
>>> Installing (31 of 189) dev-lang/python-2.7.14::gentoo
>>> Emerging binary (32 of 189) dev-python/pyblake2-0.9.3::gentoo
>>> Installing (32 of 189) dev-python/pyblake2-0.9.3::gentoo
>>> Emerging (33 of 189) dev-python/six-1.10.0::gentoo
>>> Installing (33 of 189) dev-python/six-1.10.0::gentoo
>>> Emerging (34 of 189) dev-python/appdirs-1.4.3::gentoo
>>> Installing (34 of 189) dev-python/appdirs-1.4.3::gentoo
>>> Emerging (35 of 189) dev-python/pyparsing-2.2.0::gentoo
>>> Installing (35 of 189) dev-python/pyparsing-2.2.0::gentoo
>>> Emerging (36 of 189) dev-python/packaging-16.8::gentoo
>>> Installing (36 of 189) dev-python/packaging-16.8::gentoo
>>> Emerging (37 of 189) dev-python/setuptools-34.0.2-r1::gentoo
>>> Installing (37 of 189) dev-python/setuptools-34.0.2-r1::gentoo
>>> Emerging (38 of 189) dev-python/certifi-2017.4.17::gentoo
>>> Installing (38 of 189) dev-python/certifi-2017.4.17::gentoo
>>> Emerging (39 of 189) virtual/os-headers-0::gentoo
>>> Installing (39 of 189) virtual/os-headers-0::gentoo
>>> Emerging (40 of 189) sys-apps/sysvinit-2.88-r9::gentoo
>>> Installing (40 of 189) sys-apps/sysvinit-2.88-r9::gentoo
>>> Emerging binary (41 of 189) dev-libs/openssl-1.0.2m::gentoo
>>> Installing (41 of 189) dev-libs/openssl-1.0.2m::gentoo
>>> Emerging (42 of 189) net-misc/iputils-20151218::gentoo
>>> Installing (42 of 189) net-misc/iputils-20151218::gentoo
>>> Emerging (43 of 189) virtual/libffi-3.0.13-r1::gentoo
>>> Installing (43 of 189) virtual/libffi-3.0.13-r1::gentoo
>>> Emerging binary (44 of 189) sys-apps/portage-2.3.13-r1::gentoo
>>> Installing (44 of 189) sys-apps/portage-2.3.13-r1::gentoo
>>> Emerging (45 of 189) virtual/package-manager-0::gentoo
>>> Installing (45 of 189) virtual/package-manager-0::gentoo
>>> Emerging (46 of 189) virtual/shadow-0::gentoo
>>> Installing (46 of 189) virtual/shadow-0::gentoo
>>> Emerging (47 of 189) virtual/pkgconfig-0-r1::gentoo
>>> Installing (47 of 189) virtual/pkgconfig-0-r1::gentoo
>>> Emerging (48 of 189) sys-libs/readline-6.3_p8-r3::gentoo
>>> Installing (48 of 189) sys-libs/readline-6.3_p8-r3::gentoo
>>> Emerging (49 of 189) sys-process/procps-3.3.12::gentoo
>>> Installing (49 of 189) sys-process/procps-3.3.12::gentoo
>>> Emerging (50 of 189) virtual/perl-ExtUtils-MakeMaker-7.100.200_rc-r2::gentoo
>>> Installing (50 of 189) virtual/perl-ExtUtils-MakeMaker-7.100.200_rc-r2::gentoo
>>> Emerging (51 of 189) virtual/yacc-0::gentoo
>>> Installing (51 of 189) virtual/yacc-0::gentoo
>>> Emerging (52 of 189) app-shells/bash-4.3_p48-r1::gentoo
>>> Installing (52 of 189) app-shells/bash-4.3_p48-r1::gentoo
>>> Emerging (53 of 189) virtual/perl-Test-Harness-3.360.100_rc-r2::gentoo
>>> Installing (53 of 189) virtual/perl-Test-Harness-3.360.100_rc-r2::gentoo
>>> Emerging (54 of 189) virtual/perl-File-Spec-3.630.100_rc-r2::gentoo
>>> Installing (54 of 189) virtual/perl-File-Spec-3.630.100_rc-r2::gentoo
>>> Emerging (55 of 189) virtual/perl-Data-Dumper-2.160.0-r1::gentoo
>>> Installing (55 of 189) virtual/perl-Data-Dumper-2.160.0-r1::gentoo
>>> Emerging (56 of 189) virtual/perl-Parse-CPAN-Meta-1.441.700.100_rc-r2::gentoo
>>> Installing (56 of 189) virtual/perl-Parse-CPAN-Meta-1.441.700.100_rc-r2::gentoo
>>> Emerging (57 of 189) virtual/perl-CPAN-Meta-YAML-0.18.0-r2::gentoo
>>> Installing (57 of 189) virtual/perl-CPAN-Meta-YAML-0.18.0-r2::gentoo
>>> Emerging (58 of 189) virtual/perl-File-Temp-0.230.400-r5::gentoo
>>> Installing (58 of 189) virtual/perl-File-Temp-0.230.400-r5::gentoo
>>> Emerging (59 of 189) app-admin/perl-cleaner-2.25::gentoo
>>> Installing (59 of 189) app-admin/perl-cleaner-2.25::gentoo
>>> Emerging (60 of 189) virtual/perl-Text-ParseWords-3.300.0-r3::gentoo
>>> Installing (60 of 189) virtual/perl-Text-ParseWords-3.300.0-r3::gentoo
>>> Emerging (61 of 189) virtual/perl-Perl-OSType-1.9.0-r1::gentoo
>>> Installing (61 of 189) virtual/perl-Perl-OSType-1.9.0-r1::gentoo
>>> Emerging (62 of 189) virtual/perl-Module-Metadata-1.0.31-r1::gentoo
>>> Installing (62 of 189) virtual/perl-Module-Metadata-1.0.31-r1::gentoo
>>> Emerging (63 of 189) virtual/perl-Getopt-Long-2.480.0-r1::gentoo
>>> Installing (63 of 189) virtual/perl-Getopt-Long-2.480.0-r1::gentoo
>>> Emerging (64 of 189) virtual/perl-ExtUtils-ParseXS-3.310.0-r1::gentoo
>>> Installing (64 of 189) virtual/perl-ExtUtils-ParseXS-3.310.0-r1::gentoo
>>> Emerging (65 of 189) virtual/perl-ExtUtils-Manifest-1.700.0-r4::gentoo
>>> Installing (65 of 189) virtual/perl-ExtUtils-Manifest-1.700.0-r4::gentoo
>>> Emerging (66 of 189) virtual/perl-ExtUtils-Install-2.40.0-r3::gentoo
>>> Installing (66 of 189) virtual/perl-ExtUtils-Install-2.40.0-r3::gentoo
>>> Emerging (67 of 189) virtual/perl-ExtUtils-CBuilder-0.280.225-r2::gentoo
>>> Installing (67 of 189) virtual/perl-ExtUtils-CBuilder-0.280.225-r2::gentoo
>>> Emerging (68 of 189) virtual/perl-JSON-PP-2.273.0.100_rc-r4::gentoo
>>> Installing (68 of 189) virtual/perl-JSON-PP-2.273.0.100_rc-r4::gentoo
>>> Emerging (69 of 189) virtual/perl-CPAN-Meta-2.150.5-r1::gentoo
>>> Installing (69 of 189) virtual/perl-CPAN-Meta-2.150.5-r1::gentoo
>>> Emerging (70 of 189) virtual/perl-version-0.991.600-r1::gentoo
>>> Installing (70 of 189) virtual/perl-version-0.991.600-r1::gentoo
>>> Emerging (71 of 189) virtual/perl-File-Path-2.130.0::gentoo
>>> Installing (71 of 189) virtual/perl-File-Path-2.130.0::gentoo
>>> Emerging (72 of 189) app-arch/xz-utils-5.2.3::gentoo
>>> Installing (72 of 189) app-arch/xz-utils-5.2.3::gentoo
>>> Emerging (73 of 189) sys-apps/net-tools-1.60_p20161110235919::gentoo
>>> Installing (73 of 189) sys-apps/net-tools-1.60_p20161110235919::gentoo
>>> Emerging (74 of 189) app-portage/elt-patches-20170815::gentoo
>>> Installing (74 of 189) app-portage/elt-patches-20170815::gentoo
>>> Emerging (75 of 189) sys-devel/m4-1.4.17::gentoo
>>> Installing (75 of 189) sys-devel/m4-1.4.17::gentoo
>>> Emerging (76 of 189) dev-libs/libltdl-2.4.6::gentoo
>>> Installing (76 of 189) dev-libs/libltdl-2.4.6::gentoo
>>> Emerging (77 of 189) sys-libs/zlib-1.2.11-r1::gentoo
>>> Installing (77 of 189) sys-libs/zlib-1.2.11-r1::gentoo
>>> Emerging (78 of 189) dev-libs/gmp-6.1.0::gentoo
>>> Installing (78 of 189) dev-libs/gmp-6.1.0::gentoo
>>> Emerging (79 of 189) net-firewall/iptables-1.4.21-r1::gentoo
>>> Installing (79 of 189) net-firewall/iptables-1.4.21-r1::gentoo
>>> Emerging (80 of 189) dev-libs/libffi-3.2.1::gentoo
>>> Installing (80 of 189) dev-libs/libffi-3.2.1::gentoo
>>> Emerging (81 of 189) dev-libs/libpipeline-1.4.0::gentoo
>>> Installing (81 of 189) dev-libs/libpipeline-1.4.0::gentoo
>>> Emerging (82 of 189) dev-libs/libpcre-8.41::gentoo
>>> Installing (82 of 189) dev-libs/libpcre-8.41::gentoo
>>> Emerging (83 of 189) sys-apps/file-5.32::gentoo
>>> Installing (83 of 189) sys-apps/file-5.32::gentoo
>>> Emerging (84 of 189) dev-libs/mpfr-3.1.3_p4::gentoo
>>> Installing (84 of 189) dev-libs/mpfr-3.1.3_p4::gentoo
>>> Emerging (85 of 189) sys-libs/cracklib-2.9.6-r1::gentoo
>>> Installing (85 of 189) sys-libs/cracklib-2.9.6-r1::gentoo
>>> Emerging (86 of 189) sys-apps/kmod-23::gentoo
>>> Installing (86 of 189) sys-apps/kmod-23::gentoo
>>> Emerging (87 of 189) sys-apps/less-487::gentoo
>>> Installing (87 of 189) sys-apps/less-487::gentoo
>>> Emerging (88 of 189) dev-libs/mpc-1.0.2-r1::gentoo
>>> Installing (88 of 189) dev-libs/mpc-1.0.2-r1::gentoo
>>> Emerging (89 of 189) virtual/modutils-0::gentoo
>>> Installing (89 of 189) virtual/modutils-0::gentoo
>>> Emerging (90 of 189) virtual/pager-0::gentoo
>>> Installing (90 of 189) virtual/pager-0::gentoo
>>> Emerging (91 of 189) sys-apps/attr-2.4.47-r2::gentoo
>>> Installing (91 of 189) sys-apps/attr-2.4.47-r2::gentoo
>>> Emerging (92 of 189) dev-python/pyxattr-0.5.5::gentoo
>>> Installing (92 of 189) dev-python/pyxattr-0.5.5::gentoo
>>> Emerging (93 of 189) sys-devel/patch-2.7.5::gentoo
>>> Installing (93 of 189) sys-devel/patch-2.7.5::gentoo
>>> Emerging (94 of 189) sys-kernel/linux-headers-4.4::gentoo
>>> Installing (94 of 189) sys-kernel/linux-headers-4.4::gentoo
>>> Emerging (95 of 189) sys-libs/libseccomp-2.3.2::gentoo
>>> Installing (95 of 189) sys-libs/libseccomp-2.3.2::gentoo
>>> Emerging (96 of 189) sys-apps/busybox-1.25.1::gentoo
Full build log at /home/release/tmp/run/catalyst-auto.20171120.llmaef/log/hardened_stage3.log
^ permalink raw reply [flat|nested] 24+ messages in thread
* [gentoo-releng-autobuilds] [amd64-auto] Catalyst fatal build error - hardened/stage3.spec
@ 2017-12-23 15:43 catalyst
0 siblings, 0 replies; 24+ messages in thread
From: catalyst @ 2017-12-23 15:43 UTC (permalink / raw
To: jmbsvicetto, gentoo-releng-autobuilds
23 Dec 2017 15:34:54 UTC: NOTICE : Loading configuration file: /etc/catalyst/release/amd64-auto.conf
23 Dec 2017 15:34:54 UTC: NOTICE : Processing spec file: hardened/stage3.spec
23 Dec 2017 15:34:54 UTC: NOTICE : Using target: stage3
23 Dec 2017 15:34:54 UTC: NOTICE : Source file specification matching setting is: loose
23 Dec 2017 15:34:54 UTC: NOTICE : Accepted source file extensions search order: ['tar', 'tar.xz', 'tpxz', 'xz', 'tar.bz2', 'bz2', 'tbz2', 'tar.gz', 'gz']
23 Dec 2017 15:34:55 UTC: NOTICE : Source path set to /home/release/buildroot/amd64-dev/builds/hardened/stage2-amd64-hardened-20171223T034729Z.tar.xz
23 Dec 2017 15:34:55 UTC: NOTICE : --- Running action sequence: unpack
23 Dec 2017 15:34:55 UTC: NOTICE : Clearing the chroot path ...
23 Dec 2017 15:34:55 UTC: NOTICE : Emptying directory: /home/release/buildroot/amd64-dev/tmp/hardened/stage3-amd64-hardened-20171223T034729Z
23 Dec 2017 15:34:55 UTC: NOTICE : Starting auto from /home/release/buildroot/amd64-dev/builds/hardened/stage2-amd64-hardened-20171223T034729Z.tar.xz
23 Dec 2017 15:34:55 UTC: NOTICE : to /home/release/buildroot/amd64-dev/tmp/hardened/stage3-amd64-hardened-20171223T034729Z (this may take some time) ..
23 Dec 2017 15:34:56 UTC: NOTICE : --- Running action sequence: unpack_snapshot
23 Dec 2017 15:34:56 UTC: NOTICE : Unpacking portage tree (this can take a long time) ...
23 Dec 2017 15:35:08 UTC: NOTICE : --- Running action sequence: setup_confdir
23 Dec 2017 15:35:08 UTC: NOTICE : --- Running action sequence: portage_overlay
23 Dec 2017 15:35:08 UTC: NOTICE : --- Running action sequence: base_dirs
23 Dec 2017 15:35:08 UTC: NOTICE : --- Running action sequence: bind
23 Dec 2017 15:35:08 UTC: NOTICE : --- Running action sequence: chroot_setup
23 Dec 2017 15:35:08 UTC: NOTICE : Setting up chroot...
23 Dec 2017 15:35:08 UTC: WARNING : Overriding certain env variables may cause catastrophic failure.
23 Dec 2017 15:35:08 UTC: WARNING : If your build fails look here first as the possible problem.
23 Dec 2017 15:35:08 UTC: WARNING : Catalyst assumes you know what you are doing when setting these variables.
23 Dec 2017 15:35:08 UTC: WARNING : Catalyst Maintainers use VERY minimal envscripts, if used at all.
23 Dec 2017 15:35:08 UTC: WARNING : You have been warned.
23 Dec 2017 15:35:08 UTC: NOTICE : Writing the stage make.conf to: /home/release/buildroot/amd64-dev/tmp/hardened/stage3-amd64-hardened-20171223T034729Z/etc/portage/make.conf
23 Dec 2017 15:35:08 UTC: NOTICE : STICKY-CONFIG is enabled
23 Dec 2017 15:35:08 UTC: NOTICE : --- Running action sequence: setup_environment
23 Dec 2017 15:35:08 UTC: NOTICE : --- Running action sequence: run_local
Copying stage3-chroot.sh to /tmp
copying stage3-chroot.sh to /home/release/buildroot/amd64-dev/tmp/hardened/stage3-amd64-hardened-20171223T034729Z/tmp
copying chroot-functions.sh to /home/release/buildroot/amd64-dev/tmp/hardened/stage3-amd64-hardened-20171223T034729Z/tmp
Ensure the file has the executable bit set
Running stage3-chroot.sh in chroot:
chroot /home/release/buildroot/amd64-dev/tmp/hardened/stage3-amd64-hardened-20171223T034729Z /tmp/stage3-chroot.sh
>>> Regenerating /etc/ld.so.cache...
emerge --quiet --usepkg --buildpkg --newuse --oneshot --update --newuse sys-apps/portage
>>> Verifying ebuild manifests
>>> Emerging (1 of 10) app-misc/mime-types-9::gentoo
>>> Installing (1 of 10) app-misc/mime-types-9::gentoo
>>> Emerging (2 of 10) app-misc/c_rehash-1.7-r1::gentoo
>>> Installing (2 of 10) app-misc/c_rehash-1.7-r1::gentoo
>>> Emerging (3 of 10) sys-apps/debianutils-4.7::gentoo
>>> Installing (3 of 10) sys-apps/debianutils-4.7::gentoo
>>> Emerging (4 of 10) sys-libs/gdbm-1.11::gentoo
>>> Installing (4 of 10) sys-libs/gdbm-1.11::gentoo
>>> Emerging (5 of 10) dev-libs/openssl-1.0.2n::gentoo
>>> Installing (5 of 10) dev-libs/openssl-1.0.2n::gentoo
>>> Emerging (6 of 10) app-misc/ca-certificates-20161130.3.30.2::gentoo
>>> Installing (6 of 10) app-misc/ca-certificates-20161130.3.30.2::gentoo
>>> Emerging (7 of 10) dev-lang/python-3.5.4-r1::gentoo
>>> Installing (7 of 10) dev-lang/python-3.5.4-r1::gentoo
>>> Emerging (8 of 10) dev-lang/python-2.7.14-r1::gentoo
>>> Installing (8 of 10) dev-lang/python-2.7.14-r1::gentoo
>>> Emerging (9 of 10) dev-python/pyblake2-1.1.0::gentoo
>>> Installing (9 of 10) dev-python/pyblake2-1.1.0::gentoo
>>> Emerging (10 of 10) sys-apps/portage-2.3.13-r1::gentoo
>>> Installing (10 of 10) sys-apps/portage-2.3.13-r1::gentoo
* Messages for package app-misc/ca-certificates-20161130.3.30.2:
* Log file: /home/release/tmp/logs/app-misc:ca-certificates-20161130.3.30.2:20171223-153830.log
* You should run update-ca-certificates manually after etc-update
* To prevent applications relying on system's trusted root certificate store
* from using CAs where at least one major browser vendor Gentoo is following
* has decided to apply trust level restrictions, the following
* certificate(s) were removed:
* mozilla/StartCom_Certification_Authority.crt removed; see https://bugs.gentoo.org/598072 for details
* mozilla/WoSign_China.crt removed; see https://bugs.gentoo.org/598072 for details
* mozilla/Certification_Authority_of_WoSign_G2.crt removed; see https://bugs.gentoo.org/598072 for details
* mozilla/StartCom_Certification_Authority_2.crt removed; see https://bugs.gentoo.org/598072 for details
* mozilla/CA_WoSign_ECC_Root.crt removed; see https://bugs.gentoo.org/598072 for details
* mozilla/StartCom_Certification_Authority_G2.crt removed; see https://bugs.gentoo.org/598072 for details
* mozilla/WoSign.crt removed; see https://bugs.gentoo.org/598072 for details
* Messages for package dev-python/pyblake2-1.1.0:
* Log file: /home/release/tmp/logs/dev-python:pyblake2-1.1.0:20171223-154249.log
* Could not find a UTF-8 locale. This may trigger build failures in
* some python packages. Please ensure that a UTF-8 locale is listed in
* /etc/locale.gen and run locale-gen.
* Messages for package sys-apps/portage-2.3.13-r1:
* Log file: /home/release/tmp/logs/sys-apps:portage-2.3.13-r1:20171223-154301.log
* Could not find a UTF-8 locale. This may trigger build failures in
* some python packages. Please ensure that a UTF-8 locale is listed in
* /etc/locale.gen and run locale-gen.
emerge --quiet --usepkg --buildpkg --newuse -e --update --deep --with-bdeps=y @system
[nomerge ] sys-fs/e2fsprogs-1.43.6::gentoo USE="nls -fuse -static-libs"
[nomerge ] virtual/pkgconfig-0-r1::gentoo ABI_X86="(64) -32 (-x32)"
[nomerge ] dev-util/pkgconfig-0.29.2::gentoo USE="hardened -internal-glib*" ABI_X86="(64) -32 (-x32)"
[nomerge ] dev-libs/glib-2.50.3-r1:2::gentoo USE="mime xattr -dbus -debug (-fam) (-selinux) -static-libs -systemtap {-test} -utils" ABI_X86="(64) -32 (-x32)" PYTHON_TARGETS="python2_7"
[ebuild N ] x11-misc/shared-mime-info-1.9::gentoo USE="{-test}" 0 KiB
[ebuild R ] dev-util/pkgconfig-0.29.2::gentoo USE="hardened -internal-glib*" ABI_X86="(64) -32 (-x32)" 0 KiB
[ebuild N ] dev-libs/glib-2.50.3-r1:2::gentoo USE="mime xattr -dbus -debug (-fam) (-selinux) -static-libs -systemtap {-test} -utils" ABI_X86="(64) -32 (-x32)" PYTHON_TARGETS="python2_7" 0 KiB
[ebuild N ] virtual/service-manager-0::gentoo USE="(-prefix)" 0 KiB
[nomerge ] sys-apps/openrc-0.34.11::gentoo USE="ncurses netifrc pam unicode -audit -debug -newnet (-prefix) (-selinux) -static-libs"
[ebuild N ] net-misc/netifrc-0.5.1::gentoo 0 KiB
[ebuild N ] sys-apps/openrc-0.34.11::gentoo USE="ncurses netifrc pam unicode -audit -debug -newnet (-prefix) (-selinux) -static-libs" 0 KiB
[ebuild N ] virtual/dev-manager-0::gentoo 0 KiB
[nomerge ] sys-apps/hwids-20170328::gentoo USE="net pci udev usb"
[nomerge ] virtual/udev-217::gentoo USE="-systemd"
[ebuild N ] sys-fs/eudev-3.1.5::gentoo USE="hwdb kmod -introspection -rule-generator (-selinux) -static-libs {-test}" ABI_X86="(64) -32 (-x32)" 0 KiB
[ebuild N ] sys-apps/hwids-20170328::gentoo USE="net pci udev usb" 0 KiB
[ebuild N ] sys-fs/udev-init-scripts-32::gentoo 0 KiB
[ebuild N ] virtual/udev-217::gentoo USE="-systemd" 0 KiB
[ebuild N ] virtual/ssh-0::gentoo USE="-minimal" 0 KiB
[ebuild N ] net-misc/openssh-7.5_p1-r3::gentoo USE="bindist hpn pam (pie) ssl -X -X509 -audit -debug -kerberos -ldap -ldns -libedit -libressl -livecd -sctp (-selinux) -skey -ssh1 -static {-test}" 0 KiB
[nomerge ] virtual/shadow-0::gentoo
[ebuild R ] sys-apps/shadow-4.5::gentoo USE="acl* cracklib* nls* pam* xattr* -audit (-selinux) -skey" LINGUAS="-cs -da -de -es -fi -fr -hu -id -it -ja -ko -pl -pt_BR -ru -sv -tr -zh_CN -zh_TW" 0 KiB
[nomerge ] sys-apps/util-linux-2.30.2::gentoo USE="cramfs ncurses nls pam readline suid unicode -build -caps -fdformat -kill -python (-selinux) -slang -static-libs -systemd {-test} -tty-helpers -udev" ABI_X86="(64) -32 (-x32)" PYTHON_SINGLE_TARGET="python3_5 -python2_7 -python3_4 -python3_6" PYTHON_TARGETS="python2_7 python3_5 -python3_4 -python3_6"
[ebuild N ] sys-libs/pam-1.2.1-r2::gentoo USE="berkdb cracklib filecaps nls (pie) -audit -debug -nis (-selinux) {-test}" ABI_X86="(64) -32 (-x32)" 0 KiB
[ebuild N ] sys-auth/pambase-20150213-r1::gentoo USE="cracklib nullok sha512 -consolekit -debug (-elogind) -gnome-keyring -minimal -mktemp -pam_krb5 -pam_ssh -passwdqc -securetty (-selinux) -systemd" 0 KiB
[ebuild N ] sys-apps/man-pages-4.09::gentoo USE="nls" L10N="-da -de -fr -it -ja -nl -pl -ro -ru -zh-CN" 0 KiB
[ebuild N ] sys-apps/man-pages-posix-2013a::gentoo 0 KiB
[ebuild N ] virtual/man-0-r1::gentoo 0 KiB
[ebuild N ] sys-apps/man-db-2.7.6.1-r2::gentoo USE="berkdb gdbm manpager nls zlib (-selinux) -static-libs" 0 KiB
[ebuild N ] app-text/po4a-0.47-r1::gentoo USE="{-test}" LINGUAS="-af -ca -cs -da -de -eo -es -et -eu -fr -hr -id -it -ja -kn -ko -nb -nl -pl -pt -pt_BR -ru -sl -sv -uk -vi -zh_CN -zh_HK" 0 KiB
[ebuild N ] app-text/docbook-xml-dtd-4.1.2-r6:4.1.2::gentoo 0 KiB
[ebuild N ] app-text/docbook-xsl-stylesheets-1.79.1-r2::gentoo USE="-ruby" 0 KiB
[ebuild N ] app-text/build-docbook-catalog-1.19.1::gentoo 0 KiB
[ebuild N ] sys-fs/e2fsprogs-1.43.6::gentoo USE="nls -fuse -static-libs" 0 KiB
[ebuild N ] sys-apps/util-linux-2.30.2::gentoo USE="cramfs ncurses nls pam readline suid unicode -build -caps -fdformat -kill -python (-selinux) -slang -static-libs -systemd {-test} -tty-helpers -udev" ABI_X86="(64) -32 (-x32)" PYTHON_SINGLE_TARGET="python3_5 -python2_7 -python3_4 -python3_6" PYTHON_TARGETS="python2_7 python3_5 -python3_4 -python3_6" 0 KiB
[nomerge ] sys-apps/openrc-0.34.11::gentoo USE="ncurses netifrc pam unicode -audit -debug -newnet (-prefix) (-selinux) -static-libs"
[nomerge ] virtual/pam-0-r1::gentoo ABI_X86="(64) -32 (-x32)"
[nomerge ] sys-libs/pam-1.2.1-r2::gentoo USE="berkdb cracklib filecaps nls (pie) -audit -debug -nis (-selinux) {-test}" ABI_X86="(64) -32 (-x32)"
[ebuild N ] sys-libs/libcap-2.24-r2::gentoo USE="pam -static-libs" ABI_X86="(64) -32 (-x32)" 0 KiB
[ebuild N ] sys-apps/kbd-2.0.3::gentoo USE="nls pam {-test}" 0 KiB
[ebuild N ] virtual/pam-0-r1::gentoo ABI_X86="(64) -32 (-x32)" 0 KiB
Total: 29 packages (27 new, 2 reinstalls), Size of downloads: 0 KiB
* Error: circular dependencies:
(virtual/pam-0-r1:0/0::gentoo, ebuild scheduled for merge) depends on
(sys-libs/pam-1.2.1-r2:0/0::gentoo, ebuild scheduled for merge) (runtime)
(sys-libs/libcap-2.24-r2:0/0::gentoo, ebuild scheduled for merge) (buildtime)
(virtual/pam-0-r1:0/0::gentoo, ebuild scheduled for merge) (buildtime)
It might be possible to break this cycle
by applying the following change:
- sys-libs/pam-1.2.1-r2 (Change USE: -filecaps)
Note that this change can be reverted, once the package has been installed.
23 Dec 2017 15:43:35 UTC: ERROR : CatalystError: cmd(['/usr/share/catalyst/targets/stage3/stage3-controller.sh', 'run']) exited 1
23 Dec 2017 15:43:35 UTC: ERROR : CatalystError: Stage build aborting due to error.
23 Dec 2017 15:43:35 UTC: ERROR : Exception running action sequence run_local
Traceback (most recent call last):
File "/usr/lib64/python2.7/site-packages/catalyst/base/stagebase.py", line 1437, in run
getattr(self, x)()
File "/usr/lib64/python2.7/site-packages/catalyst/base/stagebase.py", line 1346, in run_local
print_traceback=False)
CatalystError
23 Dec 2017 15:43:35 UTC: NOTICE : Cleaning up... Running unbind()
Command exited with non-zero status 2
452.14user 78.00system 8:40.86elapsed 101%CPU (0avgtext+0avgdata 328888maxresident)k
24inputs+4380872outputs (0major+47692691minor)pagefaults 0swaps
Full build log at /home/release/tmp/run/catalyst-auto.20171223T034729Z.FzUSvH/log/hardened_stage3.log
^ permalink raw reply [flat|nested] 24+ messages in thread
* [gentoo-releng-autobuilds] [amd64-auto] Catalyst fatal build error - hardened/stage3.spec
@ 2017-12-25 14:55 catalyst
0 siblings, 0 replies; 24+ messages in thread
From: catalyst @ 2017-12-25 14:55 UTC (permalink / raw
To: jmbsvicetto, gentoo-releng-autobuilds
25 Dec 2017 14:46:45 UTC: NOTICE : Loading configuration file: /etc/catalyst/release/amd64-auto.conf
25 Dec 2017 14:46:45 UTC: NOTICE : Processing spec file: hardened/stage3.spec
25 Dec 2017 14:46:46 UTC: NOTICE : Using target: stage3
25 Dec 2017 14:46:46 UTC: NOTICE : Source file specification matching setting is: loose
25 Dec 2017 14:46:46 UTC: NOTICE : Accepted source file extensions search order: ['tar', 'tar.xz', 'tpxz', 'xz', 'tar.bz2', 'bz2', 'tbz2', 'tar.gz', 'gz']
25 Dec 2017 14:46:46 UTC: NOTICE : Source path set to /home/release/buildroot/amd64-dev/builds/hardened/stage2-amd64-hardened-20171225T030001Z.tar.xz
25 Dec 2017 14:46:46 UTC: NOTICE : --- Running action sequence: unpack
25 Dec 2017 14:46:46 UTC: NOTICE : Clearing the chroot path ...
25 Dec 2017 14:46:46 UTC: NOTICE : Emptying directory: /home/release/buildroot/amd64-dev/tmp/hardened/stage3-amd64-hardened-20171225T030001Z
25 Dec 2017 14:46:46 UTC: NOTICE : Starting auto from /home/release/buildroot/amd64-dev/builds/hardened/stage2-amd64-hardened-20171225T030001Z.tar.xz
25 Dec 2017 14:46:46 UTC: NOTICE : to /home/release/buildroot/amd64-dev/tmp/hardened/stage3-amd64-hardened-20171225T030001Z (this may take some time) ..
25 Dec 2017 14:46:48 UTC: NOTICE : --- Running action sequence: unpack_snapshot
25 Dec 2017 14:46:48 UTC: NOTICE : Unpacking portage tree (this can take a long time) ...
25 Dec 2017 14:46:58 UTC: NOTICE : --- Running action sequence: setup_confdir
25 Dec 2017 14:46:58 UTC: NOTICE : --- Running action sequence: portage_overlay
25 Dec 2017 14:46:58 UTC: NOTICE : --- Running action sequence: base_dirs
25 Dec 2017 14:46:58 UTC: NOTICE : --- Running action sequence: bind
25 Dec 2017 14:46:58 UTC: NOTICE : --- Running action sequence: chroot_setup
25 Dec 2017 14:46:58 UTC: NOTICE : Setting up chroot...
25 Dec 2017 14:46:58 UTC: WARNING : Overriding certain env variables may cause catastrophic failure.
25 Dec 2017 14:46:58 UTC: WARNING : If your build fails look here first as the possible problem.
25 Dec 2017 14:46:58 UTC: WARNING : Catalyst assumes you know what you are doing when setting these variables.
25 Dec 2017 14:46:58 UTC: WARNING : Catalyst Maintainers use VERY minimal envscripts, if used at all.
25 Dec 2017 14:46:58 UTC: WARNING : You have been warned.
25 Dec 2017 14:46:59 UTC: NOTICE : Writing the stage make.conf to: /home/release/buildroot/amd64-dev/tmp/hardened/stage3-amd64-hardened-20171225T030001Z/etc/portage/make.conf
25 Dec 2017 14:46:59 UTC: NOTICE : STICKY-CONFIG is enabled
25 Dec 2017 14:46:59 UTC: NOTICE : --- Running action sequence: setup_environment
25 Dec 2017 14:46:59 UTC: NOTICE : --- Running action sequence: run_local
Copying stage3-chroot.sh to /tmp
copying stage3-chroot.sh to /home/release/buildroot/amd64-dev/tmp/hardened/stage3-amd64-hardened-20171225T030001Z/tmp
copying chroot-functions.sh to /home/release/buildroot/amd64-dev/tmp/hardened/stage3-amd64-hardened-20171225T030001Z/tmp
Ensure the file has the executable bit set
Running stage3-chroot.sh in chroot:
chroot /home/release/buildroot/amd64-dev/tmp/hardened/stage3-amd64-hardened-20171225T030001Z /tmp/stage3-chroot.sh
>>> Regenerating /etc/ld.so.cache...
emerge --quiet --usepkg --buildpkg --newuse --oneshot --update --newuse sys-apps/portage
>>> Verifying ebuild manifests
>>> Emerging (1 of 10) app-misc/mime-types-9::gentoo
>>> Installing (1 of 10) app-misc/mime-types-9::gentoo
>>> Emerging (2 of 10) app-misc/c_rehash-1.7-r1::gentoo
>>> Installing (2 of 10) app-misc/c_rehash-1.7-r1::gentoo
>>> Emerging (3 of 10) sys-apps/debianutils-4.7::gentoo
>>> Installing (3 of 10) sys-apps/debianutils-4.7::gentoo
>>> Emerging (4 of 10) sys-libs/gdbm-1.11::gentoo
>>> Installing (4 of 10) sys-libs/gdbm-1.11::gentoo
>>> Emerging (5 of 10) dev-libs/openssl-1.0.2n::gentoo
>>> Installing (5 of 10) dev-libs/openssl-1.0.2n::gentoo
>>> Emerging (6 of 10) app-misc/ca-certificates-20161130.3.30.2::gentoo
>>> Installing (6 of 10) app-misc/ca-certificates-20161130.3.30.2::gentoo
>>> Emerging (7 of 10) dev-lang/python-3.5.4-r1::gentoo
>>> Installing (7 of 10) dev-lang/python-3.5.4-r1::gentoo
>>> Emerging (8 of 10) dev-lang/python-2.7.14-r1::gentoo
>>> Installing (8 of 10) dev-lang/python-2.7.14-r1::gentoo
>>> Emerging (9 of 10) dev-python/pyblake2-1.1.0::gentoo
>>> Installing (9 of 10) dev-python/pyblake2-1.1.0::gentoo
>>> Emerging (10 of 10) sys-apps/portage-2.3.13-r1::gentoo
>>> Installing (10 of 10) sys-apps/portage-2.3.13-r1::gentoo
* Messages for package app-misc/ca-certificates-20161130.3.30.2:
* Log file: /home/release/tmp/logs/app-misc:ca-certificates-20161130.3.30.2:20171225-145014.log
* You should run update-ca-certificates manually after etc-update
* To prevent applications relying on system's trusted root certificate store
* from using CAs where at least one major browser vendor Gentoo is following
* has decided to apply trust level restrictions, the following
* certificate(s) were removed:
* mozilla/StartCom_Certification_Authority.crt removed; see https://bugs.gentoo.org/598072 for details
* mozilla/WoSign_China.crt removed; see https://bugs.gentoo.org/598072 for details
* mozilla/Certification_Authority_of_WoSign_G2.crt removed; see https://bugs.gentoo.org/598072 for details
* mozilla/StartCom_Certification_Authority_2.crt removed; see https://bugs.gentoo.org/598072 for details
* mozilla/CA_WoSign_ECC_Root.crt removed; see https://bugs.gentoo.org/598072 for details
* mozilla/StartCom_Certification_Authority_G2.crt removed; see https://bugs.gentoo.org/598072 for details
* mozilla/WoSign.crt removed; see https://bugs.gentoo.org/598072 for details
* Messages for package dev-python/pyblake2-1.1.0:
* Log file: /home/release/tmp/logs/dev-python:pyblake2-1.1.0:20171225-145435.log
* Could not find a UTF-8 locale. This may trigger build failures in
* some python packages. Please ensure that a UTF-8 locale is listed in
* /etc/locale.gen and run locale-gen.
* Messages for package sys-apps/portage-2.3.13-r1:
* Log file: /home/release/tmp/logs/sys-apps:portage-2.3.13-r1:20171225-145447.log
* Could not find a UTF-8 locale. This may trigger build failures in
* some python packages. Please ensure that a UTF-8 locale is listed in
* /etc/locale.gen and run locale-gen.
emerge --quiet --usepkg --buildpkg --newuse -e --update --deep --with-bdeps=y @system
[nomerge ] virtual/service-manager-0::gentoo USE="(-prefix)"
[nomerge ] sys-apps/openrc-0.34.11::gentoo USE="ncurses netifrc pam unicode -audit -debug -newnet (-prefix) (-selinux) -static-libs"
[nomerge ] net-misc/netifrc-0.5.1::gentoo
[nomerge ] virtual/pkgconfig-0-r1::gentoo ABI_X86="(64) -32 (-x32)"
[nomerge ] dev-util/pkgconfig-0.29.2::gentoo USE="hardened -internal-glib*" ABI_X86="(64) -32 (-x32)"
[nomerge ] dev-libs/glib-2.50.3-r1:2::gentoo USE="mime xattr -dbus -debug (-fam) (-selinux) -static-libs -systemtap {-test} -utils" ABI_X86="(64) -32 (-x32)" PYTHON_TARGETS="python2_7"
[ebuild N ] x11-misc/shared-mime-info-1.9::gentoo USE="{-test}" 0 KiB
[ebuild R ] dev-util/pkgconfig-0.29.2::gentoo USE="hardened -internal-glib*" ABI_X86="(64) -32 (-x32)" 0 KiB
[ebuild N ] dev-libs/glib-2.50.3-r1:2::gentoo USE="mime xattr -dbus -debug (-fam) (-selinux) -static-libs -systemtap {-test} -utils" ABI_X86="(64) -32 (-x32)" PYTHON_TARGETS="python2_7" 0 KiB
[ebuild N ] virtual/service-manager-0::gentoo USE="(-prefix)" 0 KiB
[ebuild N ] net-misc/netifrc-0.5.1::gentoo 0 KiB
[ebuild N ] sys-apps/openrc-0.34.11::gentoo USE="ncurses netifrc pam unicode -audit -debug -newnet (-prefix) (-selinux) -static-libs" 0 KiB
[ebuild N ] virtual/dev-manager-0::gentoo 0 KiB
[nomerge ] sys-fs/udev-init-scripts-32::gentoo
[nomerge ] virtual/udev-217::gentoo USE="-systemd"
[ebuild N ] sys-fs/eudev-3.1.5::gentoo USE="hwdb kmod -introspection -rule-generator (-selinux) -static-libs {-test}" ABI_X86="(64) -32 (-x32)" 0 KiB
[ebuild N ] sys-apps/hwids-20170328::gentoo USE="net pci udev usb" 0 KiB
[ebuild N ] sys-fs/udev-init-scripts-32::gentoo 0 KiB
[ebuild N ] virtual/udev-217::gentoo USE="-systemd" 0 KiB
[ebuild N ] virtual/ssh-0::gentoo USE="-minimal" 0 KiB
[nomerge ] virtual/shadow-0::gentoo
[ebuild R ] sys-apps/shadow-4.5::gentoo USE="acl* cracklib* nls* pam* xattr* -audit (-selinux) -skey" LINGUAS="-cs -da -de -es -fi -fr -hu -id -it -ja -ko -pl -pt_BR -ru -sv -tr -zh_CN -zh_TW" 0 KiB
[nomerge ] virtual/ssh-0::gentoo USE="-minimal"
[ebuild N ] net-misc/openssh-7.5_p1-r3::gentoo USE="bindist hpn pam (pie) ssl -X -X509 -audit -debug -kerberos -ldap -ldns -libedit -libressl -livecd -sctp (-selinux) -skey -ssh1 -static {-test}" 0 KiB
[nomerge ] sys-apps/util-linux-2.30.2::gentoo USE="cramfs ncurses nls pam readline suid unicode -build -caps -fdformat -kill -python (-selinux) -slang -static-libs -systemd {-test} -tty-helpers -udev" ABI_X86="(64) -32 (-x32)" PYTHON_SINGLE_TARGET="python3_5 -python2_7 -python3_4 -python3_6" PYTHON_TARGETS="python2_7 python3_5 -python3_4 -python3_6"
[ebuild N ] sys-libs/pam-1.2.1-r2::gentoo USE="berkdb cracklib filecaps nls (pie) -audit -debug -nis (-selinux) {-test}" ABI_X86="(64) -32 (-x32)" 0 KiB
[ebuild N ] sys-auth/pambase-20150213-r1::gentoo USE="cracklib nullok sha512 -consolekit -debug (-elogind) -gnome-keyring -minimal -mktemp -pam_krb5 -pam_ssh -passwdqc -securetty (-selinux) -systemd" 0 KiB
[ebuild N ] sys-apps/man-pages-4.09::gentoo USE="nls" L10N="-da -de -fr -it -ja -nl -pl -ro -ru -zh-CN" 0 KiB
[ebuild N ] sys-apps/man-pages-posix-2013a::gentoo 0 KiB
[ebuild N ] virtual/man-0-r1::gentoo 0 KiB
[ebuild N ] sys-apps/man-db-2.7.6.1-r2::gentoo USE="berkdb gdbm manpager nls zlib (-selinux) -static-libs" 0 KiB
[ebuild N ] app-text/po4a-0.47-r1::gentoo USE="{-test}" LINGUAS="-af -ca -cs -da -de -eo -es -et -eu -fr -hr -id -it -ja -kn -ko -nb -nl -pl -pt -pt_BR -ru -sl -sv -uk -vi -zh_CN -zh_HK" 0 KiB
[ebuild N ] app-text/docbook-xml-dtd-4.1.2-r6:4.1.2::gentoo 0 KiB
[ebuild N ] app-text/docbook-xsl-stylesheets-1.79.1-r2::gentoo USE="-ruby" 0 KiB
[ebuild N ] app-text/build-docbook-catalog-1.19.1::gentoo 0 KiB
[ebuild N ] sys-fs/e2fsprogs-1.43.6::gentoo USE="nls -fuse -static-libs" 0 KiB
[ebuild N ] sys-apps/util-linux-2.30.2::gentoo USE="cramfs ncurses nls pam readline suid unicode -build -caps -fdformat -kill -python (-selinux) -slang -static-libs -systemd {-test} -tty-helpers -udev" ABI_X86="(64) -32 (-x32)" PYTHON_SINGLE_TARGET="python3_5 -python2_7 -python3_4 -python3_6" PYTHON_TARGETS="python2_7 python3_5 -python3_4 -python3_6" 0 KiB
[nomerge ] net-misc/openssh-7.5_p1-r3::gentoo USE="bindist hpn pam (pie) ssl -X -X509 -audit -debug -kerberos -ldap -ldns -libedit -libressl -livecd -sctp (-selinux) -skey -ssh1 -static {-test}"
[nomerge ] virtual/pam-0-r1::gentoo ABI_X86="(64) -32 (-x32)"
[nomerge ] sys-libs/pam-1.2.1-r2::gentoo USE="berkdb cracklib filecaps nls (pie) -audit -debug -nis (-selinux) {-test}" ABI_X86="(64) -32 (-x32)"
[ebuild N ] sys-libs/libcap-2.24-r2::gentoo USE="pam -static-libs" ABI_X86="(64) -32 (-x32)" 0 KiB
[ebuild N ] sys-apps/kbd-2.0.3::gentoo USE="nls pam {-test}" 0 KiB
[ebuild N ] virtual/pam-0-r1::gentoo ABI_X86="(64) -32 (-x32)" 0 KiB
Total: 29 packages (27 new, 2 reinstalls), Size of downloads: 0 KiB
* Error: circular dependencies:
(sys-libs/libcap-2.24-r2:0/0::gentoo, ebuild scheduled for merge) depends on
(virtual/pam-0-r1:0/0::gentoo, ebuild scheduled for merge) (buildtime)
(sys-libs/pam-1.2.1-r2:0/0::gentoo, ebuild scheduled for merge) (runtime)
(sys-libs/libcap-2.24-r2:0/0::gentoo, ebuild scheduled for merge) (buildtime)
It might be possible to break this cycle
by applying any of the following changes:
- sys-libs/pam-1.2.1-r2 (Change USE: -filecaps)
- sys-libs/libcap-2.24-r2 (Change USE: -pam)
Note that this change can be reverted, once the package has been installed.
25 Dec 2017 14:55:21 UTC: ERROR : CatalystError: cmd(['/usr/share/catalyst/targets/stage3/stage3-controller.sh', 'run']) exited 1
25 Dec 2017 14:55:22 UTC: ERROR : CatalystError: Stage build aborting due to error.
25 Dec 2017 14:55:22 UTC: ERROR : Exception running action sequence run_local
Traceback (most recent call last):
File "/usr/lib64/python2.7/site-packages/catalyst/base/stagebase.py", line 1437, in run
getattr(self, x)()
File "/usr/lib64/python2.7/site-packages/catalyst/base/stagebase.py", line 1346, in run_local
print_traceback=False)
CatalystError
25 Dec 2017 14:55:22 UTC: NOTICE : Cleaning up... Running unbind()
Command exited with non-zero status 2
458.36user 76.28system 8:37.18elapsed 103%CPU (0avgtext+0avgdata 328656maxresident)k
8inputs+4380256outputs (0major+47644286minor)pagefaults 0swaps
Full build log at /home/release/tmp/run/catalyst-auto.20171225T030001Z.FEn4Mb/log/hardened_stage3.log
^ permalink raw reply [flat|nested] 24+ messages in thread
* [gentoo-releng-autobuilds] [amd64-auto] Catalyst fatal build error - hardened/stage3.spec
@ 2020-12-21 23:28 catalyst
0 siblings, 0 replies; 24+ messages in thread
From: catalyst @ 2020-12-21 23:28 UTC (permalink / raw
To: releng, gentoo-releng-autobuilds
>>> Emerging binary (181 of 228) dev-util/intltool-0.51.0-r2::gentoo
>>> Installing (181 of 228) dev-util/intltool-0.51.0-r2::gentoo
>>> Emerging binary (182 of 228) net-misc/openssh-8.1_p1-r4::gentoo
>>> Installing (182 of 228) net-misc/openssh-8.1_p1-r4::gentoo
>>> Emerging binary (183 of 228) sys-fs/e2fsprogs-1.45.5::gentoo
>>> Installing (183 of 228) sys-fs/e2fsprogs-1.45.5::gentoo
>>> Emerging binary (184 of 228) app-text/build-docbook-catalog-1.21::gentoo
>>> Installing (184 of 228) app-text/build-docbook-catalog-1.21::gentoo
>>> Emerging binary (185 of 228) sys-apps/help2man-1.47.16::gentoo
>>> Installing (185 of 228) sys-apps/help2man-1.47.16::gentoo
>>> Emerging binary (186 of 228) virtual/ssh-0::gentoo
>>> Installing (186 of 228) virtual/ssh-0::gentoo
>>> Emerging binary (187 of 228) app-text/docbook-xsl-stylesheets-1.79.1-r2::gentoo
>>> Installing (187 of 228) app-text/docbook-xsl-stylesheets-1.79.1-r2::gentoo
>>> Emerging binary (188 of 228) app-text/docbook-xml-dtd-4.1.2-r7::gentoo
>>> Installing (188 of 228) app-text/docbook-xml-dtd-4.1.2-r7::gentoo
>>> Emerging binary (189 of 228) app-text/docbook-xml-dtd-4.5-r2::gentoo
>>> Installing (189 of 228) app-text/docbook-xml-dtd-4.5-r2::gentoo
>>> Emerging binary (190 of 228) app-text/docbook-xml-dtd-4.2-r3::gentoo
>>> Installing (190 of 228) app-text/docbook-xml-dtd-4.2-r3::gentoo
>>> Emerging (191 of 228) app-text/po4a-0.57::gentoo
>>> Emerging binary (192 of 228) dev-python/idna-2.10-r1::gentoo
>>> Failed to emerge app-text/po4a-0.57
>>> Installing (192 of 228) dev-python/idna-2.10-r1::gentoo
* Messages for package sys-fs/eudev-3.2.9:
*
* As of 2013-01-29, eudev-3.2.9 provides the new interface renaming functionality,
* as described in the URL below:
* https://www.freedesktop.org/wiki/Software/systemd/PredictableNetworkInterfaceNames
*
* This functionality is enabled BY DEFAULT because eudev has no means of synchronizing
* between the default or user-modified choice of sys-fs/udev. If you wish to disable
* this new iface naming, please be sure that /etc/udev/rules.d/80-net-name-slot.rules
* exists: touch /etc/udev/rules.d/80-net-name-slot.rules
*
* Messages for package acct-group/man-0:
* Adding group 'man' to your system ...
* - Groupid: 15
* Messages for package sys-apps/baselayout-2.7:
* The following users have non-existent shells!
* halt - /sbin/halt
* shutdown - /sbin/shutdown
* Messages for package acct-user/man-1:
* Adding user 'man' to your system ...
* - Userid: 13
* - Shell: /sbin/nologin
* - Home: /dev/null
* - Groups: man
* - GECOS: added by portage for man
* Updating comment for user 'man' ...
* - Comment: System user; man
* Messages for package sys-libs/timezone-data-2020d:
* You do not have TIMEZONE set in /etc/timezone.
* Skipping auto-update of /etc/localtime.
* Messages for package sys-apps/sysvinit-2.97:
* The last/lastb/mesg/mountpoint/sulogin/utmpdump/wall tools have been moved to
* sys-apps/util-linux. The pidof tool has been moved to sys-process/procps.
* Messages for package sys-apps/coreutils-8.32-r1:
* Make sure you run 'hash -r' in your active shells.
* You should also re-source your shell settings for LS_COLORS
* changes, such as: source /etc/profile
* Messages for package net-firewall/iptables-1.8.5:
* Current iptables implementation is unset, setting to xtables-legacy-multi
* Messages for package sys-apps/man-db-2.9.3:
* Defaulting to USE=gdbm due to ambiguous berkdb/gdbm USE flag settings
* Messages for package dev-libs/libxml2-2.9.10-r4:
* Skipping XML catalog creation for stage building (bug #208887).
* Messages for package sys-libs/pam-1.5.1:
* Some software with pre-loaded PAM libraries might experience
* warnings or failures related to missing symbols and/or versions
* after any update. While unfortunate this is a limit of the
* implementation of PAM and the software, and it requires you to
* restart the software manually after the update.
*
* You can get a list of such software running a command like
* lsof / | egrep -i 'del.*libpam\.so'
*
* Alternatively, simply reboot your system.
* Messages for package sys-auth/pambase-20201103:
* To amend the existing password policy please see the man 5
* passwdqc.conf page and then edit the /etc/security/passwdqc.conf file
*
* (Note: Above message is only printed the first time package is
* installed. Please look at /usr/share/doc/pambase-20201103/README.gentoo*
* for future reference)
* Messages for package sys-apps/util-linux-2.35.2:
* The mesg/wall/write tools have been disabled due to USE=-tty-helpers.
* Messages for package sys-apps/shadow-4.8-r5:
* Running 'grpck' returned errors. Please run it by hand, and then
* run 'grpconv' afterwards!
* Messages for package app-text/po4a-0.57:
* ERROR: app-text/po4a-0.57::gentoo failed (compile phase):
* Compilation failed
*
* Call stack:
* ebuild.sh, line 125: Called src_compile
* environment, line 1169: Called perl-module_src_compile
* environment, line 698: Called die
* The specific snippet of code:
* ./Build build || die "Compilation failed";
*
* If you need support, post the output of `emerge --info '=app-text/po4a-0.57::gentoo'`,
* the complete build log and the output of `emerge -pqv '=app-text/po4a-0.57::gentoo'`.
* The complete build log is located at '/var/tmp/portage/app-text/po4a-0.57/temp/build.log'.
* The ebuild environment file is located at '/var/tmp/portage/app-text/po4a-0.57/temp/environment'.
* Working directory: '/var/tmp/portage/app-text/po4a-0.57/work/po4a-0.57'
* S: '/var/tmp/portage/app-text/po4a-0.57/work/po4a-0.57'
21 Dec 2020 23:28:25 UTC: ERROR : CatalystError: cmd(['/usr/share/catalyst/targets/stage3/stage3-controller.sh', 'run']) exited 1
ERROR:catalyst:CatalystError: cmd(['/usr/share/catalyst/targets/stage3/stage3-controller.sh', 'run']) exited 1
21 Dec 2020 23:28:25 UTC: NOTICE : /release/buildroot/amd64-dev/tmp/hardened/stage3-amd64-hardened-20201220T214503Z/var/tmp/portage is not a mount point. Skipping
NOTICE:catalyst:/release/buildroot/amd64-dev/tmp/hardened/stage3-amd64-hardened-20201220T214503Z/var/tmp/portage is not a mount point. Skipping
21 Dec 2020 23:28:25 UTC: ERROR : CatalystError: Stage build aborting due to error.
ERROR:catalyst:CatalystError: Stage build aborting due to error.
21 Dec 2020 23:28:25 UTC: ERROR : Exception running action sequence run_local
Traceback (most recent call last):
File "/usr/lib/python3.7/site-packages/catalyst/base/stagebase.py", line 1410, in run_local
env=self.env)
File "/usr/lib/python3.7/site-packages/catalyst/support.py", line 54, in cmd
print_traceback=False)
catalyst.support.CatalystError: cmd(['/usr/share/catalyst/targets/stage3/stage3-controller.sh', 'run']) exited 1
During handling of the above exception, another exception occurred:
Traceback (most recent call last):
File "/usr/lib/python3.7/site-packages/catalyst/base/stagebase.py", line 1515, in run
getattr(self, x)()
File "/usr/lib/python3.7/site-packages/catalyst/base/stagebase.py", line 1419, in run_local
print_traceback=False)
catalyst.support.CatalystError: Stage build aborting due to error.
ERROR:catalyst:Exception running action sequence run_local
Traceback (most recent call last):
File "/usr/lib/python3.7/site-packages/catalyst/base/stagebase.py", line 1410, in run_local
env=self.env)
File "/usr/lib/python3.7/site-packages/catalyst/support.py", line 54, in cmd
print_traceback=False)
catalyst.support.CatalystError: cmd(['/usr/share/catalyst/targets/stage3/stage3-controller.sh', 'run']) exited 1
During handling of the above exception, another exception occurred:
Traceback (most recent call last):
File "/usr/lib/python3.7/site-packages/catalyst/base/stagebase.py", line 1515, in run
getattr(self, x)()
File "/usr/lib/python3.7/site-packages/catalyst/base/stagebase.py", line 1419, in run_local
print_traceback=False)
catalyst.support.CatalystError: Stage build aborting due to error.
21 Dec 2020 23:28:25 UTC: NOTICE : Cleaning up... Running unbind()
NOTICE:catalyst:Cleaning up... Running unbind()
21 Dec 2020 23:28:25 UTC: NOTICE : /release/buildroot/amd64-dev/tmp/hardened/stage3-amd64-hardened-20201220T214503Z/tmp/kerncache is not a mount point. Skipping
NOTICE:catalyst:/release/buildroot/amd64-dev/tmp/hardened/stage3-amd64-hardened-20201220T214503Z/tmp/kerncache is not a mount point. Skipping
21 Dec 2020 23:28:25 UTC: NOTICE : /release/buildroot/amd64-dev/tmp/hardened/stage3-amd64-hardened-20201220T214503Z/var/cache/binpkgs is not a mount point. Skipping
NOTICE:catalyst:/release/buildroot/amd64-dev/tmp/hardened/stage3-amd64-hardened-20201220T214503Z/var/cache/binpkgs is not a mount point. Skipping
21 Dec 2020 23:28:25 UTC: NOTICE : /release/buildroot/amd64-dev/tmp/hardened/stage3-amd64-hardened-20201220T214503Z/run is not a mount point. Skipping
NOTICE:catalyst:/release/buildroot/amd64-dev/tmp/hardened/stage3-amd64-hardened-20201220T214503Z/run is not a mount point. Skipping
21 Dec 2020 23:28:25 UTC: NOTICE : /release/buildroot/amd64-dev/tmp/hardened/stage3-amd64-hardened-20201220T214503Z/dev/shm does not exist. Skipping
NOTICE:catalyst:/release/buildroot/amd64-dev/tmp/hardened/stage3-amd64-hardened-20201220T214503Z/dev/shm does not exist. Skipping
21 Dec 2020 23:28:25 UTC: NOTICE : /release/buildroot/amd64-dev/tmp/hardened/stage3-amd64-hardened-20201220T214503Z/dev/pts does not exist. Skipping
NOTICE:catalyst:/release/buildroot/amd64-dev/tmp/hardened/stage3-amd64-hardened-20201220T214503Z/dev/pts does not exist. Skipping
21 Dec 2020 23:28:25 UTC: NOTICE : /release/buildroot/amd64-dev/tmp/hardened/stage3-amd64-hardened-20201220T214503Z/var/tmp/portage is not a mount point. Skipping
NOTICE:catalyst:/release/buildroot/amd64-dev/tmp/hardened/stage3-amd64-hardened-20201220T214503Z/var/tmp/portage is not a mount point. Skipping
21 Dec 2020 23:28:25 UTC: NOTICE : /release/buildroot/amd64-dev/tmp/hardened/stage3-amd64-hardened-20201220T214503Z/var/cache/distfiles is not a mount point. Skipping
NOTICE:catalyst:/release/buildroot/amd64-dev/tmp/hardened/stage3-amd64-hardened-20201220T214503Z/var/cache/distfiles is not a mount point. Skipping
21 Dec 2020 23:28:25 UTC: NOTICE : /release/buildroot/amd64-dev/tmp/hardened/stage3-amd64-hardened-20201220T214503Z/var/db/repos/gentoo is not a mount point. Skipping
NOTICE:catalyst:/release/buildroot/amd64-dev/tmp/hardened/stage3-amd64-hardened-20201220T214503Z/var/db/repos/gentoo is not a mount point. Skipping
21 Dec 2020 23:28:25 UTC: NOTICE : /release/buildroot/amd64-dev/tmp/hardened/stage3-amd64-hardened-20201220T214503Z/dev is not a mount point. Skipping
NOTICE:catalyst:/release/buildroot/amd64-dev/tmp/hardened/stage3-amd64-hardened-20201220T214503Z/dev is not a mount point. Skipping
21 Dec 2020 23:28:25 UTC: NOTICE : /release/buildroot/amd64-dev/tmp/hardened/stage3-amd64-hardened-20201220T214503Z/proc is not a mount point. Skipping
NOTICE:catalyst:/release/buildroot/amd64-dev/tmp/hardened/stage3-amd64-hardened-20201220T214503Z/proc is not a mount point. Skipping
Command exited with non-zero status 2
1337.52user 598.62system 24:36.66elapsed 131%CPU (0avgtext+0avgdata 99792maxresident)k
305120inputs+3412704outputs (11major+94867031minor)pagefaults 0swaps
Full build log at /release/tmp/run/catalyst-auto.20201220T214503Z.wzR8WF/log/hardened_stage3.log
^ permalink raw reply [flat|nested] 24+ messages in thread
* [gentoo-releng-autobuilds] [amd64-auto] Catalyst fatal build error - hardened/stage3.spec
@ 2020-12-24 11:51 catalyst
0 siblings, 0 replies; 24+ messages in thread
From: catalyst @ 2020-12-24 11:51 UTC (permalink / raw
To: releng, gentoo-releng-autobuilds
>>> Failed to emerge app-text/po4a-0.57
>>> Installing (197 of 228) net-misc/wget-1.20.3-r3::gentoo
>>> Installing (198 of 228) sys-apps/diffutils-3.7-r1::gentoo
>>> Installing (199 of 228) sys-fs/e2fsprogs-1.45.5::gentoo
>>> Installing (196 of 228) sys-devel/make-4.3::gentoo
>>> Installing (207 of 228) dev-python/idna-2.10-r1::gentoo
* Messages for package sys-fs/eudev-3.2.9:
*
* As of 2013-01-29, eudev-3.2.9 provides the new interface renaming functionality,
* as described in the URL below:
* https://www.freedesktop.org/wiki/Software/systemd/PredictableNetworkInterfaceNames
*
* This functionality is enabled BY DEFAULT because eudev has no means of synchronizing
* between the default or user-modified choice of sys-fs/udev. If you wish to disable
* this new iface naming, please be sure that /etc/udev/rules.d/80-net-name-slot.rules
* exists: touch /etc/udev/rules.d/80-net-name-slot.rules
*
* Messages for package acct-group/man-0:
* Adding group 'man' to your system ...
* - Groupid: 15
* Messages for package sys-apps/baselayout-2.7:
* The following users have non-existent shells!
* halt - /sbin/halt
* shutdown - /sbin/shutdown
* Messages for package acct-user/man-1:
* Adding user 'man' to your system ...
* - Userid: 13
* - Shell: /sbin/nologin
* - Home: /dev/null
* - Groups: man
* - GECOS: added by portage for man
* Updating comment for user 'man' ...
* - Comment: System user; man
* Messages for package sys-libs/timezone-data-2020d:
* You do not have TIMEZONE set in /etc/timezone.
* Skipping auto-update of /etc/localtime.
* Messages for package sys-apps/sysvinit-2.97:
* The last/lastb/mesg/mountpoint/sulogin/utmpdump/wall tools have been moved to
* sys-apps/util-linux. The pidof tool has been moved to sys-process/procps.
* Messages for package sys-apps/coreutils-8.32-r1:
* Make sure you run 'hash -r' in your active shells.
* You should also re-source your shell settings for LS_COLORS
* changes, such as: source /etc/profile
* Messages for package sys-apps/man-db-2.9.3:
* Defaulting to USE=gdbm due to ambiguous berkdb/gdbm USE flag settings
* Messages for package net-firewall/iptables-1.8.5:
* Current iptables implementation is unset, setting to xtables-legacy-multi
* Messages for package sys-libs/pam-1.5.1:
* Some software with pre-loaded PAM libraries might experience
* warnings or failures related to missing symbols and/or versions
* after any update. While unfortunate this is a limit of the
* implementation of PAM and the software, and it requires you to
* restart the software manually after the update.
*
* You can get a list of such software running a command like
* lsof / | egrep -i 'del.*libpam\.so'
*
* Alternatively, simply reboot your system.
* Messages for package sys-auth/pambase-20201103:
* To amend the existing password policy please see the man 5
* passwdqc.conf page and then edit the /etc/security/passwdqc.conf file
*
* (Note: Above message is only printed the first time package is
* installed. Please look at /usr/share/doc/pambase-20201103/README.gentoo*
* for future reference)
* Messages for package sys-apps/shadow-4.8-r5:
* Running 'grpck' returned errors. Please run it by hand, and then
* run 'grpconv' afterwards!
* Messages for package sys-apps/util-linux-2.35.2:
* The mesg/wall/write tools have been disabled due to USE=-tty-helpers.
* Messages for package net-misc/netifrc-0.7.1-r1:
* The network configuration scripts will use dhcp by
* default to set up your interfaces.
* If you need to set up something more complete, see
* /usr/share/doc/netifrc-0.7.1/README
* Messages for package sys-fs/eudev-3.2.9:
*
* For more information on eudev on Gentoo, writing udev rules, and
* fixing known issues visit: https://wiki.gentoo.org/wiki/Eudev
* Messages for package sys-fs/udev-init-scripts-34:
* Adding udev to the sysinit runlevel
* Adding udev-trigger to the sysinit runlevel
* Messages for package dev-libs/libxml2-2.9.10-r4:
* Skipping XML catalog creation for stage building (bug #208887).
* Messages for package app-text/po4a-0.57:
* ERROR: app-text/po4a-0.57::gentoo failed (compile phase):
* Compilation failed
*
* Call stack:
* ebuild.sh, line 125: Called src_compile
* environment, line 1169: Called perl-module_src_compile
* environment, line 698: Called die
* The specific snippet of code:
* ./Build build || die "Compilation failed";
*
* If you need support, post the output of `emerge --info '=app-text/po4a-0.57::gentoo'`,
* the complete build log and the output of `emerge -pqv '=app-text/po4a-0.57::gentoo'`.
* The complete build log is located at '/var/tmp/portage/app-text/po4a-0.57/temp/build.log'.
* The ebuild environment file is located at '/var/tmp/portage/app-text/po4a-0.57/temp/environment'.
* Working directory: '/var/tmp/portage/app-text/po4a-0.57/work/po4a-0.57'
* S: '/var/tmp/portage/app-text/po4a-0.57/work/po4a-0.57'
24 Dec 2020 11:51:34 UTC: ERROR : CatalystError: cmd(['/usr/share/catalyst/targets/stage3/stage3-controller.sh', 'run']) exited 1
ERROR:catalyst:CatalystError: cmd(['/usr/share/catalyst/targets/stage3/stage3-controller.sh', 'run']) exited 1
24 Dec 2020 11:51:34 UTC: NOTICE : /release/buildroot/amd64-dev/tmp/hardened/stage3-amd64-hardened-20201223T214504Z/var/tmp/portage is not a mount point. Skipping
NOTICE:catalyst:/release/buildroot/amd64-dev/tmp/hardened/stage3-amd64-hardened-20201223T214504Z/var/tmp/portage is not a mount point. Skipping
24 Dec 2020 11:51:35 UTC: ERROR : CatalystError: Stage build aborting due to error.
ERROR:catalyst:CatalystError: Stage build aborting due to error.
24 Dec 2020 11:51:35 UTC: ERROR : Exception running action sequence run_local
Traceback (most recent call last):
File "/usr/lib/python3.7/site-packages/catalyst/base/stagebase.py", line 1410, in run_local
env=self.env)
File "/usr/lib/python3.7/site-packages/catalyst/support.py", line 54, in cmd
print_traceback=False)
catalyst.support.CatalystError: cmd(['/usr/share/catalyst/targets/stage3/stage3-controller.sh', 'run']) exited 1
During handling of the above exception, another exception occurred:
Traceback (most recent call last):
File "/usr/lib/python3.7/site-packages/catalyst/base/stagebase.py", line 1515, in run
getattr(self, x)()
File "/usr/lib/python3.7/site-packages/catalyst/base/stagebase.py", line 1419, in run_local
print_traceback=False)
catalyst.support.CatalystError: Stage build aborting due to error.
ERROR:catalyst:Exception running action sequence run_local
Traceback (most recent call last):
File "/usr/lib/python3.7/site-packages/catalyst/base/stagebase.py", line 1410, in run_local
env=self.env)
File "/usr/lib/python3.7/site-packages/catalyst/support.py", line 54, in cmd
print_traceback=False)
catalyst.support.CatalystError: cmd(['/usr/share/catalyst/targets/stage3/stage3-controller.sh', 'run']) exited 1
During handling of the above exception, another exception occurred:
Traceback (most recent call last):
File "/usr/lib/python3.7/site-packages/catalyst/base/stagebase.py", line 1515, in run
getattr(self, x)()
File "/usr/lib/python3.7/site-packages/catalyst/base/stagebase.py", line 1419, in run_local
print_traceback=False)
catalyst.support.CatalystError: Stage build aborting due to error.
24 Dec 2020 11:51:35 UTC: NOTICE : Cleaning up... Running unbind()
NOTICE:catalyst:Cleaning up... Running unbind()
24 Dec 2020 11:51:35 UTC: NOTICE : /release/buildroot/amd64-dev/tmp/hardened/stage3-amd64-hardened-20201223T214504Z/tmp/kerncache is not a mount point. Skipping
NOTICE:catalyst:/release/buildroot/amd64-dev/tmp/hardened/stage3-amd64-hardened-20201223T214504Z/tmp/kerncache is not a mount point. Skipping
24 Dec 2020 11:51:35 UTC: NOTICE : /release/buildroot/amd64-dev/tmp/hardened/stage3-amd64-hardened-20201223T214504Z/var/cache/binpkgs is not a mount point. Skipping
NOTICE:catalyst:/release/buildroot/amd64-dev/tmp/hardened/stage3-amd64-hardened-20201223T214504Z/var/cache/binpkgs is not a mount point. Skipping
24 Dec 2020 11:51:35 UTC: NOTICE : /release/buildroot/amd64-dev/tmp/hardened/stage3-amd64-hardened-20201223T214504Z/run is not a mount point. Skipping
NOTICE:catalyst:/release/buildroot/amd64-dev/tmp/hardened/stage3-amd64-hardened-20201223T214504Z/run is not a mount point. Skipping
24 Dec 2020 11:51:35 UTC: NOTICE : /release/buildroot/amd64-dev/tmp/hardened/stage3-amd64-hardened-20201223T214504Z/dev/shm does not exist. Skipping
NOTICE:catalyst:/release/buildroot/amd64-dev/tmp/hardened/stage3-amd64-hardened-20201223T214504Z/dev/shm does not exist. Skipping
24 Dec 2020 11:51:35 UTC: NOTICE : /release/buildroot/amd64-dev/tmp/hardened/stage3-amd64-hardened-20201223T214504Z/dev/pts does not exist. Skipping
NOTICE:catalyst:/release/buildroot/amd64-dev/tmp/hardened/stage3-amd64-hardened-20201223T214504Z/dev/pts does not exist. Skipping
24 Dec 2020 11:51:35 UTC: NOTICE : /release/buildroot/amd64-dev/tmp/hardened/stage3-amd64-hardened-20201223T214504Z/var/tmp/portage is not a mount point. Skipping
NOTICE:catalyst:/release/buildroot/amd64-dev/tmp/hardened/stage3-amd64-hardened-20201223T214504Z/var/tmp/portage is not a mount point. Skipping
24 Dec 2020 11:51:35 UTC: NOTICE : /release/buildroot/amd64-dev/tmp/hardened/stage3-amd64-hardened-20201223T214504Z/var/cache/distfiles is not a mount point. Skipping
NOTICE:catalyst:/release/buildroot/amd64-dev/tmp/hardened/stage3-amd64-hardened-20201223T214504Z/var/cache/distfiles is not a mount point. Skipping
24 Dec 2020 11:51:35 UTC: NOTICE : /release/buildroot/amd64-dev/tmp/hardened/stage3-amd64-hardened-20201223T214504Z/var/db/repos/gentoo is not a mount point. Skipping
NOTICE:catalyst:/release/buildroot/amd64-dev/tmp/hardened/stage3-amd64-hardened-20201223T214504Z/var/db/repos/gentoo is not a mount point. Skipping
24 Dec 2020 11:51:35 UTC: NOTICE : /release/buildroot/amd64-dev/tmp/hardened/stage3-amd64-hardened-20201223T214504Z/dev is not a mount point. Skipping
NOTICE:catalyst:/release/buildroot/amd64-dev/tmp/hardened/stage3-amd64-hardened-20201223T214504Z/dev is not a mount point. Skipping
24 Dec 2020 11:51:35 UTC: NOTICE : /release/buildroot/amd64-dev/tmp/hardened/stage3-amd64-hardened-20201223T214504Z/proc is not a mount point. Skipping
NOTICE:catalyst:/release/buildroot/amd64-dev/tmp/hardened/stage3-amd64-hardened-20201223T214504Z/proc is not a mount point. Skipping
Command exited with non-zero status 2
1181.81user 483.14system 21:12.73elapsed 130%CPU (0avgtext+0avgdata 184088maxresident)k
307720inputs+3185736outputs (0major+78790157minor)pagefaults 0swaps
Full build log at /release/tmp/run/catalyst-auto.20201223T214504Z.2OhPQP/log/hardened_stage3.log
^ permalink raw reply [flat|nested] 24+ messages in thread
end of thread, other threads:[~2020-12-24 11:51 UTC | newest]
Thread overview: 24+ messages (download: mbox.gz follow: Atom feed
-- links below jump to the message on this page --
2012-08-16 22:56 [gentoo-releng-autobuilds] [amd64-auto] Catalyst fatal build error - hardened/stage3.spec catalyst
-- strict thread matches above, loose matches on Subject: below --
2020-12-24 11:51 catalyst
2020-12-21 23:28 catalyst
2017-12-25 14:55 catalyst
2017-12-23 15:43 catalyst
2017-12-11 11:37 catalyst
2015-12-25 8:33 catalyst
2015-11-26 7:02 catalyst
2015-06-22 9:32 catalyst
2014-12-07 7:52 catalyst
2014-11-24 15:09 catalyst
2012-08-23 20:19 catalyst
2012-08-10 3:28 catalyst
2012-07-20 15:22 catalyst
2012-07-05 23:22 catalyst
2012-06-28 22:49 catalyst
2012-06-07 13:44 catalyst
2012-04-19 23:39 catalyst
2012-04-12 23:42 catalyst
2012-04-05 23:35 catalyst
2012-03-29 23:39 catalyst
2012-03-22 23:07 catalyst
2011-05-19 17:43 catalyst
2011-05-12 17:58 catalyst
This is a public inbox, see mirroring instructions
for how to clone and mirror all data and code used for this inbox